{"text_format":"1","workbook":"xlsx","n_sheets":4,"sheets":["Pracovní doba","PD_FORMULÁŘ","typ dne","List1"],"not_rendered":{"charts":0,"images":1,"macros":1,"external_links":0,"defined_names":27,"comments":1,"pivot_tables":0},"unopened":[],"bounds":{"document_bytes":16777216,"sheet_cells":100000,"rows_first":2000,"rows_last":500,"rows_between":2000,"halvings":0,"cell_chars":16384,"cell_head_chars":4096},"cells_cut":0,"cells_raw":0,"read":"whole","date_system":"1900"}

{"sheet":"Pracovní doba","index":0,"n_rows":61,"n_cols":40,"rows_kept":61,"cut":false,"hidden":false,"merged":[[51,10,51,11],[52,10,52,11],[53,10,53,11],[54,10,54,11],[0,4,0,5],[1,4,1,5],[13,4,13,8],[8,0,8,9],[10,4,10,8],[10,0,11,3],[11,4,11,8],[26,0,26,1],[27,0,27,1],[28,0,28,1],[29,0,29,1],[15,4,15,8],[21,0,21,1],[22,0,22,1],[23,0,23,1],[24,0,24,1],[19,0,19,1],[20,0,20,1],[25,0,25,1],[36,0,36,1],[37,0,37,1],[38,0,38,1],[39,0,39,1],[30,0,30,1],[40,0,40,1],[31,0,31,1],[32,0,32,1],[33,0,33,1],[34,0,34,1],[35,0,35,1],[49,0,49,1],[48,0,48,1],[41,0,41,1],[46,0,46,1],[47,0,47,1],[43,0,43,1],[44,0,44,1],[45,0,45,1],[42,0,42,1],[17,13,18,13],[17,14,18,14],[17,11,17,12],[13,0,13,3],[17,0,18,2],[17,3,18,3],[17,4,18,4],[17,5,18,7],[17,8,18,8],[17,9,18,9],[17,10,18,10],[15,0,15,3]]}
[null,null,null,"Měsíc:",1]
[null,null,null,"Rok:",2022]
[null,null,null,"Dnů v měsící:",{"$f":"VALUE(DAY(DATE($E$2,$E$1+1,1)-DATE($E$2,$E$1,1)))","v":31}]
[null,null,null,"Příchod:","07:00:00"]
[null,null,null,"Přestávka:","11:00:00",{"$f":"IF(E5=\"\",\"\",E5+1/48)","v":"11:30:00"},"11:30:00"]
[null,null,null,"Odchod:","15:30:00"]
[null,null,null,"MAX:",{"$f":"1/24*22","v":"22:00:00"}]
[]
["Evidence pracovní doby"]
[]
["Útvar/NS"]
[null,null,null,null,{"$f":"IF(ISERROR(VLOOKUP(E11,'typ dne'!Y:Z,2,0)),\"\",VLOOKUP(E11,'typ dne'!Y:Z,2,0))","v":""}]
[]
["Jméno",null,null,null,null,null,null,null,null,"Období",{"$f":"DATE(E2,E1,1)","v":"2022-01-01"}]
[]
["Osobní číslo zaměstnance",null,null,null,null,null,null,null,null,"Úvazek",1]
[]
["Den",null,null,"TYP dne","Příchod","Pracovní přestávka na jídlo a oddech",null,null,"Odchod","Speciální den (vyplňuje se automaticky v závislosti na TYP dne)","Poznámka (V případě potřeby, SC kratší než 1 den apod…)","Odpracováno ",null,"Délka nepřetržitého odpočinku (min 35h)","Přestávka     na jídlo                 (max. po 6h)"]
[null,null,null,null,null,null,null,null,null,null,null,"Celkem       (vč. \"S\" a \"SC\")","z toho        přímá pedag. činnost",null,null,"Odpracováno","Neodpracováno","PŘESTÁVKA","ODPRACOVÁNO","Počet H od půlnoci","Počet H do půlnoci","Den volna","Hodiny volna do začátku směny (v rámic 24 h)","Hodiny volna do začátku směny (celkem)",null,"Nápověda"]
[1,null,{"$f":"IF(A20=\"\",A20,HLOOKUP(WEEKDAY(DATE(rok,mesic,A20),2),tyden,2))","v":"So"},{"$f":"IF(OR(A20=\"\",C20=\"So\",C20=\"Ne\"),\"\",\"P\")","v":""},{"$f":"IF(D20=\"\",\"\",IF(D20=\"P\",prichod,\"\"))","v":""},{"$f":"IF(D20=\"\",\"\",IF(prestavka=\"\",\"\",IF(D20=\"P\",prestavka,\"\")))","v":""},"-",{"$f":"IF(F20=\"\",\"\",F20+1/48)","v":""},{"$f":"IF(D20=\"\",\"\",IF(D20=\"P\",odchod,\"\"))","v":""},{"$f":"IF(D20=\"\",\"\",IF(D20=\"P\",\"\",VLOOKUP(D20,vyjímky,2)))","v":""},null,{"$f":"IF(OR(D20=\"SC\",D20=\"S\"),(1/3)*uvazek,IF(D20=\"P\",IF(P20=\"\",\"\",P20/24),\"\"))","v":""},null,{"$f":"IF(C17=\"Po\",IF(C24=\"Ne\",MAX(X19:X25),\"\"),\"\")","v":""},{"$f":"IF(ISERROR(R20),\"\",R20)","v":""},{"$f":"IF(D20=\"\",\"\",IF(F20=\"\",(HOUR(I20)+MINUTE(I20)/60)-(HOUR(E20)+MINUTE(E20)/60),IF(OR(D20=\"SC\",D20=\"S\"),(1/3)*uvazek,IF(E20=\"\",\"\",(IF(D20=\"\",\"\",(IF(I20=\"\",0,(HOUR(I20)+MINUTE(I20)/60))-IF(E20=\"\",0,(HOUR(E20)+MINUTE(E20)/60)))))-(IF(D20=\"\",\"\",(IF(I20=\"\",0,(HOUR(H20)+MINUTE(H20)/60))-IF(E20=\"\",0,(HOUR(F20)+MINUTE(F20)/60)))))))))","v":""},{"$f":"IF(OR(D20=\"§\",D20=\"D\",D20=\"IV\",D20=\"L\",D20=\"N\",D20=\"NpV\",D20=\"NV\",D20=\"OČR\",D20=\"OPP\",D20=\"RD\",D20=\"MD\"),(1/3)*uvazek,\"\")","v":""},{"$f":"IF(D20=\"\",\"\",IF(F20=\"\",(HOUR(I20)+(MINUTE(I20)/60))-(HOUR(E20)+(MINUTE(E20)/60)),IF(E20=\"\",\"\",IF((HOUR(F20)+(MINUTE(F20)/60))-(HOUR(E20)+(MINUTE(E20)/60))>6,(HOUR(F20)+(MINUTE(F20)/60))-(HOUR(E20)+(MINUTE(E20)/60)),\"\"))))","v":""},{"$f":"IF(L20=\"\",0,L20)","v":"00:00:00"},{"$f":"IF(E20=\"\",0,(HOUR(E20)+MINUTE(E20)/60))","v":0},{"$f":"IF(I20=\"\",0,24-(HOUR(I20)+MINUTE(I20)/60))","v":0},{"$f":"IF((T20+U20)=0,\"ANO\",\"NE\")","v":"ANO"},{"$f":"IF(V20=\"ANO\",24,Y19+T20)","v":24},{"$f":"IF(C20=\"Po\",W20,IF(W20=24,IF(W19<>24,W20+U19,X19+W20),IF(W19=24,W20+X19,W20)))","v":{"$error":"#VALUE!"}},{"$f":"IF(C20=\"Po\",IF(C26=\"Ne\",MAX(X21:X27),\"\"),\"\")","v":""},"1 - vyplňte měsíc a rok",null,null,null,null,null,{"$f":"IF(OR(AC20=\"\",AE20=\"So\",AE20=\"Ne\"),\"\",\"P\")","v":""},{"$f":"IF(AF20=\"\",\"\",IF(AF20=\"P\",prichod,\"\"))","v":""},{"$f":"IF(AF20=\"\",\"\",IF(prestavka=\"\",\"\",IF(AF20=\"P\",prestavka,\"\")))","v":""},"-",{"$f":"IF(AH20=\"\",\"\",AH20+1/48)","v":""},{"$f":"IF(AF20=\"\",\"\",IF(AF20=\"P\",odchod,\"\"))","v":""},{"$f":"IF(AF20=\"\",\"\",IF(AF20=\"P\",\"\",VLOOKUP(AF20,vyjímky,2)))","v":""},null,{"$f":"IF(OR(AF20=\"SC\",AF20=\"S\"),(1/3)*uvazek,IF(AF20=\"P\",IF(AR20=\"\",\"\",AR20/24),\"\"))","v":""}]
[{"$f":"IF(A20<dny,A20+1,\"\")","v":2},null,"Ne","","","","-","","","",null,"",null,{"$f":"IF(C19=\"Po\",IF(C25=\"Ne\",MAX(X20:X26),\"\"),\"\")","v":""},"","","","","00:00:00",0,0,"ANO",{"$f":"IF(V21=\"ANO\",24,U20+T21)","v":24},{"$error":"#VALUE!"},"","2 - vyplňte čas příchodu, přestávky a odchodu (formulář tyto hodnoty automaticky předvyplní, případné odchylky v jednotlivých dnech upravíte přímo ve formuláři)",null,null,null,null,null,"","","","-","","","",null,""]
[3,null,"Po","P","07:00:00","11:00:00","-","11:30:00","15:30:00","",null,{"$f":"IF(OR(D22=\"SC\",D22=\"S\"),(1/3)*uvazek,IF(D22=\"P\",IF(P22=\"\",\"\",P22/24),\"\"))","v":"08:00:00"},null,"","",8,"","","08:00:00",7,8.5,"NE",7,7,56.5,"3 - z předdefinovaného seznamu vyberte Útvar či NS, vyplňte jméno a OSČ",null,null,null,null,null,"","","","-","","","",null,""]
[4,null,"Út","P","07:00:00","11:00:00","-","11:30:00","15:30:00","",null,"08:00:00",null,"",{"$f":"IF(ISERROR(R23),\"\",R23)","v":""},8,"","","08:00:00",7,8.5,"NE",15.5,{"$f":"IF(C23=\"Po\",W23,IF(W23=24,IF(W22<>24,W23+U22,X22+W23),IF(W22=24,W23+X22,W23)))","v":15.5},"","4 - vyplňte výši vašeho úvazku",null,null,null,null,null,"","","","-","","","",null,""]
[5,null,"St","P","07:00:00","11:00:00","-","11:30:00","15:30:00","",null,"08:00:00",null,56.5,{"$f":"IF(ISERROR(R24),\"\",R24)","v":""},8,"","","08:00:00",7,8.5,"NE",15.5,{"$f":"IF(C24=\"Po\",W24,IF(W24=24,IF(W23<>24,W24+U23,X23+W24),IF(W23=24,W24+X23,W24)))","v":15.5},"",null,null,null,null,null,null,"","","","-","","","",null,""]
[6,null,"Čt","P","07:00:00","11:00:00","-","11:30:00","15:30:00","",null,"08:00:00",null,"","",8,"","","08:00:00",7,8.5,"NE",15.5,15.5,"","5 - vyplňte \"TYP dne\" z předdefinovaného seznamu",null,null,"§","placený paragraf ",null,"P","07:00:00","11:00:00","-","11:30:00","15:30:00","",null,""]
[7,null,"Pá","P","07:00:00","11:00:00","-","11:30:00","15:30:00","",null,"08:00:00",null,"","",8,"","","08:00:00",7,8.5,"NE",15.5,15.5,"","     u víkendových dní je \"TYP dne\" defaultně bez vyplnění, v případě pracovního víkendu vyberte z předdefinovaného seznamu",null,null,"D","dovolená",null,"P","07:00:00","11:00:00","-","11:30:00","15:30:00","",null,""]
[8,null,"So","","","","-","","","",null,"",null,"","","","","","00:00:00",0,0,"ANO",24,32.5,"","     v případě služební cesty, která nebyla celodenní, vyberte jako \"TYP dne\" \"P\" a do poznámky napište \"SC\" s informací od-do",null,null,"IV","indispoziční volno",null,"P","07:00:00","11:00:00","-","11:30:00","15:30:00","",null,""]
[9,null,"Ne","","","","-","","","",null,"",null,"","","","","","00:00:00",0,0,"ANO",24,56.5,"","6 - vyplňte \"Příchod\" ve formátu \"HH:MM\"",null,null,"L","lékař",null,"P","07:00:00","11:00:00","-","11:30:00","15:30:00","",null,""]
[10,null,"Po","P","07:00:00","11:00:00","-","11:30:00","15:30:00","",null,"08:00:00",null,"","",8,"","","08:00:00",7,8.5,"NE",7,7,56.5,"7 - vyplňte\" Začátek přestávky\" ve formátu \"HH:MM\"",null,null,"MD","mateřská dovolená",null,"P","07:00:00","11:00:00","-","11:30:00","15:30:00","",null,""]
[11,null,"Út","P","07:00:00","11:00:00","-","11:30:00","15:30:00","",null,"08:00:00",null,"","",8,"","","08:00:00",7,8.5,"NE",15.5,15.5,"","     pokud přestávka neproběhla (například z důvodů dřívějšího odchodu) - vymažte \"začátek přestávky\"",null,null,"N","nemoc",null,"P","07:00:00","11:00:00","-","11:30:00","15:30:00","",null,""]
[12,null,"St","P","07:00:00","11:00:00","-","11:30:00","15:30:00","",null,"08:00:00",null,56.5,"",8,"","","08:00:00",7,8.5,"NE",15.5,15.5,"","8 - vyplňte \"Konec přestávky\" ve formátu \"HH:MM\"",null,null,"NpV","neplacené volno",null,"P","07:00:00","11:00:00","-","11:30:00","15:30:00","",null,""]
[13,null,"Čt","P","07:00:00","11:00:00","-","11:30:00","15:30:00","",null,"08:00:00",null,"","",8,"","","08:00:00",7,8.5,"NE",15.5,15.5,"","     pokud přestávka neproběhla - je buňka automaticky nevyplněna při kroku č.7",null,null,"NV","náhradní volno",null,"P","07:00:00","11:00:00","-","11:30:00","15:30:00","",null,""]
[14,null,"Pá","P","07:00:00","11:00:00","-","11:30:00","15:30:00","",null,"08:00:00",null,"","",8,"","","08:00:00",7,8.5,"NE",15.5,15.5,"","9 - vyplňte \"Odchod\" ve formátu \"HH:MM\"",null,null,"OČR","ošetřování člena rodiny",null,"P","07:00:00","11:00:00","-","11:30:00","15:30:00","",null,""]
[15,null,"So","","","","-","","","",null,"",null,"","","","","","00:00:00",0,0,"ANO",24,32.5,"","10 - v případě přímé pedagogické činnosti vyplňte \"z toho přímá pedag. činnost\" ve formátu \"HH:MM\"",null,null,"OPP","otcovská poporodní péče",null,"P","07:00:00","11:00:00","-","11:30:00","15:30:00","",null,""]
[16,null,"Ne","","","","-","","","",null,"",null,"","","","","","00:00:00",0,0,"ANO",24,56.5,"",null,null,null,"P","odpracovaná doba",null,"P","07:00:00","11:00:00","-","11:30:00","15:30:00","",null,""]
[17,null,"Po","P","07:00:00","11:00:00","-","11:30:00","15:30:00","",null,"08:00:00",null,"","",8,"","","08:00:00",7,8.5,"NE",7,7,56.5,"Formulář má nastavené dva základní hlídače (Odpočinek v týdnu min 35h - \"sloupec M\" a přestávku na jídlo max po 6h - \"sloupec N\")",null,null,"RD","rodičovská dovolená",null,"P","07:00:00","11:00:00","-","11:30:00","15:30:00","",null,""]
[18,null,"Út","P","07:00:00","11:00:00","-","11:30:00","15:30:00","",null,"08:00:00",null,"","",8,"","","08:00:00",7,8.5,"NE",15.5,15.5,"","Hlídač na \"Odpočinek v týdnu\" je nastaven pouze u celých týdnů v rámci jednoho měsíce",null,null,"S","svátek",null,"P","07:00:00","11:00:00","-","11:30:00","15:30:00","",null,""]
[19,null,"St","P","07:00:00","11:00:00","-","11:30:00","15:30:00","",null,"08:00:00",null,56.5,"",8,"","","08:00:00",7,8.5,"NE",15.5,15.5,"",null,null,null,"SC","služební cesta",null,"P","07:00:00","11:00:00","-","11:30:00","15:30:00","",null,""]
[20,null,"Čt","P","07:00:00","11:00:00","-","11:30:00","15:30:00","",null,"08:00:00",null,"","",8,"","","08:00:00",7,8.5,"NE",15.5,15.5,"",null,null,null,null,null,null,"","","","-","","","",null,""]
[21,null,"Pá","P","07:00:00","11:00:00","-","11:30:00","15:30:00","",null,"08:00:00",null,"","",8,"","","08:00:00",7,8.5,"NE",15.5,15.5,"",null,null,null,null,null,null,"","","","-","","","",null,""]
[22,null,"So","","","","-","","","",null,"",null,"","","","","","00:00:00",0,0,"ANO",24,32.5,"",null,null,null,null,null,null,"","","","-","","","",null,""]
[23,null,"Ne","","","","-","","","",null,"",null,"","","","","","00:00:00",0,0,"ANO",24,56.5,"",null,null,null,null,null,null,"","","","-","","","",null,""]
[24,null,"Po","P","07:00:00","11:00:00","-","11:30:00","15:30:00","",null,"08:00:00",null,"","",8,"","","08:00:00",7,8.5,"NE",7,7,56.5,null,null,null,null,null,null,"","","","-","","","",null,""]
[25,null,"Út","P","07:00:00","11:00:00","-","11:30:00","15:30:00","",null,"08:00:00",null,"","",8,"","","08:00:00",7,8.5,"NE",15.5,15.5,{"$f":"IF(C44=\"Po\",IF(C50=\"Ne\",MAX(Z47:Z53),\"\"),\"\")","v":""},null,null,null,null,null,null,"","","","-","","","",null,""]
[26,null,"St","P","07:00:00","11:00:00","-","11:30:00","15:30:00","",null,"08:00:00",null,56.5,"",8,"","","08:00:00",7,8.5,"NE",15.5,15.5,"",null,null,null,null,null,null,"","","","-","","","",null,""]
[27,null,"Čt","P","07:00:00","11:00:00","-","11:30:00","15:30:00","",null,"08:00:00",null,{"$f":"IF(C44=\"Po\",IF(C50=\"Ne\",MAX(Z47:Z53),\"\"),\"\")","v":""},"",8,"","","08:00:00",7,8.5,"NE",15.5,15.5,"",null,null,null,null,null,null,"","","","-","","","",null,""]
[28,null,"Pá","P","07:00:00","11:00:00","-","11:30:00","15:30:00","",null,"08:00:00",null,{"$f":"IF(C45=\"Po\",IF(C51=\"Ne\",MAX(Z48:Z54),\"\"),\"\")","v":""},"",8,"","","08:00:00",7,8.5,"NE",15.5,15.5,{"$f":"IF(C47=\"Po\",IF(C53=\"Ne\",MAX(Z50:Z57),\"\"),\"\")","v":""},null,null,null,null,null,null,"","","","-","","","",null,""]
[29,null,"So","","","","-","","","",null,"",null,{"$f":"IF(C46=\"Po\",IF(C52=\"Ne\",MAX(Z49:Z55),\"\"),\"\")","v":""},"","","","","00:00:00",0,0,"ANO",24,32.5,{"$f":"IF(C48=\"Po\",IF(C54=\"Ne\",MAX(Z51:Z58),\"\"),\"\")","v":""},null,null,null,null,null,null,"","","","-","","","",null,""]
[30,null,"Ne","","","","-","","","",null,"",null,{"$f":"IF(C47=\"Po\",IF(C53=\"Ne\",MAX(Z50:Z57),\"\"),\"\")","v":""},"","","","","00:00:00",0,0,"ANO",24,56.5,{"$f":"IF(C49=\"Po\",IF(C55=\"Ne\",MAX(Z52:Z60),\"\"),\"\")","v":""},null,null,null,null,null,null,"","","","-","","","",null,""]
[31,null,"Po","P","07:00:00","11:00:00","-","11:30:00","15:30:00","",null,"08:00:00",null,{"$f":"IF(C48=\"Po\",IF(C54=\"Ne\",MAX(Z51:Z58),\"\"),\"\")","v":""},"",8,"","","08:00:00",7,8.5,"NE",7,7,{"$f":"IF(C50=\"Po\",IF(C57=\"Ne\",MAX(Z53:Z61),\"\"),\"\")","v":""},null,null,null,null,null,null,"","","","-","","","",null,""]
[]
[null,null,null,null,null,null,null,null,null,null,"fond pracovní doby",null,{"$f":"(VLOOKUP(K14,'typ dne'!U2:V61,2,0))*uvazek","v":168}]
[null,null,null,null,null,null,null,null,null,null,"odpracováno vč. SC a svátek",null,{"$f":"SUM(L20:L50)*24","v":167.99999999999994}]
[null,null,null,null,null,null,null,null,null,null,"z toho přímá pedag. činnost",null,{"$f":"SUM(M20:M50)*24","v":0}]
[null,null,null,null,null,null,null,null,null,null,"neodpracováno",null,{"$f":"IF(SUM(Q20:Q50)=0,0,SUM(Q20:Q50)*24)","v":0}]
[null,null,null,null,null,null,null,null,null,null,"kontrola",null,{"$f":"ROUND(M53+M55-M52,2)","v":0},{"$f":"IF(M56<0,\"VYKÁZANÉ HODINY NEDOSAHUJÍ FONDU PRACOVNÍ DOBY\",IF(ROUND(M56,2)=0,\"\",\"VYKÁZANÉ HODINY PŘESAHUJÍ FOND PRACOVNÍ DOBY\"))","v":""}]
["Datum a podpis zaměstnance:"]
[]
[]
[]
["Datum a podpis nadřízeného pracovníka:"]

{"sheet":"PD_FORMULÁŘ","index":1,"n_rows":53,"n_cols":13,"rows_kept":53,"cut":false,"hidden":true,"merged":[[43,10,43,11],[44,10,44,11],[45,10,45,11],[46,10,46,11],[36,0,36,1],[37,0,37,1],[38,0,38,1],[39,0,39,1],[40,0,40,1],[41,0,41,1],[35,0,35,1],[24,0,24,1],[25,0,25,1],[26,0,26,1],[27,0,27,1],[28,0,28,1],[29,0,29,1],[30,0,30,1],[31,0,31,1],[32,0,32,1],[33,0,33,1],[34,0,34,1],[23,0,23,1],[12,0,12,1],[13,0,13,1],[14,0,14,1],[15,0,15,1],[16,0,16,1],[17,0,17,1],[18,0,18,1],[19,0,19,1],[20,0,20,1],[21,0,21,1],[22,0,22,1],[9,10,10,10],[9,11,9,12],[11,0,11,1],[5,0,5,3],[5,4,5,8],[7,0,7,3],[7,4,7,8],[9,0,10,2],[9,3,10,3],[9,4,10,4],[9,5,10,7],[9,8,10,8],[0,0,0,9],[2,0,3,3],[2,4,2,8],[3,4,3,8],[9,9,10,9]]}
["Evidence pracovní doby"]
[]
["Útvar/NS",null,null,null,{"$f":"IF('Pracovní doba'!$E$11:$I$11=\"\",\"\",'Pracovní doba'!$E$11:$I$11)","v":""}]
[null,null,null,null,{"$f":"IF('Pracovní doba'!$E$12:$I$12=\"\",\"\",'Pracovní doba'!$E$12:$I$12)","v":""}]
[]
["Jméno",null,null,null,{"$f":"IF('Pracovní doba'!$E$14:$I$14=\"\",\"\",'Pracovní doba'!$E$14:$I$14)","v":""},null,null,null,null,"Období",{"$f":"IF('Pracovní doba'!K14=\"\",\"\",'Pracovní doba'!K14)","v":"2022-01-01"}]
[]
["Osobní číslo zaměstnance",null,null,null,{"$f":"IF('Pracovní doba'!$E$16:$I$16=\"\",\"\",'Pracovní doba'!$E$16:$I$16)","v":""},null,null,null,null,"Úvazek",{"$f":"IF('Pracovní doba'!K16=\"\",\"\",'Pracovní doba'!K16)","v":1}]
[]
["Den",null,null,"TYP dne","Příchod","Pracovní přestávka na jídlo a oddech",null,null,"Odchod","Speciální den (vyplňuje se automaticky v závislosti na TYP dne)","Poznámka (V případě potřeby, SC kratší než 1 den apod…)","Odpracováno "]
[null,null,null,null,null,null,null,null,null,null,null,"Celkem       (vč. \"S\" a \"SC\")","z toho        přímá pedag. činnost"]
[1,null,{"$f":"'Pracovní doba'!C20","v":"So"},{"$f":"IF('Pracovní doba'!D20=\"\",\"\",'Pracovní doba'!D20)","v":""},{"$f":"IF('Pracovní doba'!E20=\"\",\"\",'Pracovní doba'!E20)","v":""},{"$f":"IF('Pracovní doba'!F20=\"\",\"\",'Pracovní doba'!F20)","v":""},"-",{"$f":"IF('Pracovní doba'!H20=\"\",\"\",'Pracovní doba'!H20)","v":""},{"$f":"IF('Pracovní doba'!I20=\"\",\"\",'Pracovní doba'!I20)","v":""},{"$f":"IF('Pracovní doba'!J20=\"\",\"\",'Pracovní doba'!J20)","v":""},{"$f":"IF('Pracovní doba'!K20=\"\",\"\",'Pracovní doba'!K20)","v":""},{"$f":"IF('Pracovní doba'!L20=\"\",\"\",'Pracovní doba'!L20)","v":""},{"$f":"IF('Pracovní doba'!M20=\"\",\"\",'Pracovní doba'!M20)","v":""}]
[{"$f":"'Pracovní doba'!A21:B21","v":2},null,{"$f":"'Pracovní doba'!C21","v":"Ne"},{"$f":"IF('Pracovní doba'!D21=\"\",\"\",'Pracovní doba'!D21)","v":""},{"$f":"IF('Pracovní doba'!E21=\"\",\"\",'Pracovní doba'!E21)","v":""},{"$f":"IF('Pracovní doba'!F21=\"\",\"\",'Pracovní doba'!F21)","v":""},"-",{"$f":"IF('Pracovní doba'!H21=\"\",\"\",'Pracovní doba'!H21)","v":""},{"$f":"IF('Pracovní doba'!I21=\"\",\"\",'Pracovní doba'!I21)","v":""},{"$f":"IF('Pracovní doba'!J21=\"\",\"\",'Pracovní doba'!J21)","v":""},{"$f":"IF('Pracovní doba'!K21=\"\",\"\",'Pracovní doba'!K21)","v":""},{"$f":"IF('Pracovní doba'!L21=\"\",\"\",'Pracovní doba'!L21)","v":""},{"$f":"IF('Pracovní doba'!M21=\"\",\"\",'Pracovní doba'!M21)","v":""}]
[{"$f":"'Pracovní doba'!A22:B22","v":3},null,{"$f":"'Pracovní doba'!C22","v":"Po"},{"$f":"IF('Pracovní doba'!D22=\"\",\"\",'Pracovní doba'!D22)","v":"P"},{"$f":"IF('Pracovní doba'!E22=\"\",\"\",'Pracovní doba'!E22)","v":"07:00:00"},{"$f":"IF('Pracovní doba'!F22=\"\",\"\",'Pracovní doba'!F22)","v":"11:00:00"},"-",{"$f":"IF('Pracovní doba'!H22=\"\",\"\",'Pracovní doba'!H22)","v":"11:30:00"},{"$f":"IF('Pracovní doba'!I22=\"\",\"\",'Pracovní doba'!I22)","v":"15:30:00"},{"$f":"IF('Pracovní doba'!J22=\"\",\"\",'Pracovní doba'!J22)","v":""},{"$f":"IF('Pracovní doba'!K22=\"\",\"\",'Pracovní doba'!K22)","v":""},{"$f":"IF('Pracovní doba'!L22=\"\",\"\",'Pracovní doba'!L22)","v":"08:00:00"},{"$f":"IF('Pracovní doba'!M22=\"\",\"\",'Pracovní doba'!M22)","v":""}]
[{"$f":"'Pracovní doba'!A23:B23","v":4},null,{"$f":"'Pracovní doba'!C23","v":"Út"},{"$f":"IF('Pracovní doba'!D23=\"\",\"\",'Pracovní doba'!D23)","v":"P"},{"$f":"IF('Pracovní doba'!E23=\"\",\"\",'Pracovní doba'!E23)","v":"07:00:00"},{"$f":"IF('Pracovní doba'!F23=\"\",\"\",'Pracovní doba'!F23)","v":"11:00:00"},"-",{"$f":"IF('Pracovní doba'!H23=\"\",\"\",'Pracovní doba'!H23)","v":"11:30:00"},{"$f":"IF('Pracovní doba'!I23=\"\",\"\",'Pracovní doba'!I23)","v":"15:30:00"},{"$f":"IF('Pracovní doba'!J23=\"\",\"\",'Pracovní doba'!J23)","v":""},{"$f":"IF('Pracovní doba'!K23=\"\",\"\",'Pracovní doba'!K23)","v":""},{"$f":"IF('Pracovní doba'!L23=\"\",\"\",'Pracovní doba'!L23)","v":"08:00:00"},{"$f":"IF('Pracovní doba'!M23=\"\",\"\",'Pracovní doba'!M23)","v":""}]
[{"$f":"'Pracovní doba'!A24:B24","v":5},null,{"$f":"'Pracovní doba'!C24","v":"St"},{"$f":"IF('Pracovní doba'!D24=\"\",\"\",'Pracovní doba'!D24)","v":"P"},{"$f":"IF('Pracovní doba'!E24=\"\",\"\",'Pracovní doba'!E24)","v":"07:00:00"},{"$f":"IF('Pracovní doba'!F24=\"\",\"\",'Pracovní doba'!F24)","v":"11:00:00"},"-",{"$f":"IF('Pracovní doba'!H24=\"\",\"\",'Pracovní doba'!H24)","v":"11:30:00"},{"$f":"IF('Pracovní doba'!I24=\"\",\"\",'Pracovní doba'!I24)","v":"15:30:00"},{"$f":"IF('Pracovní doba'!J24=\"\",\"\",'Pracovní doba'!J24)","v":""},{"$f":"IF('Pracovní doba'!K24=\"\",\"\",'Pracovní doba'!K24)","v":""},{"$f":"IF('Pracovní doba'!L24=\"\",\"\",'Pracovní doba'!L24)","v":"08:00:00"},{"$f":"IF('Pracovní doba'!M24=\"\",\"\",'Pracovní doba'!M24)","v":""}]
[{"$f":"'Pracovní doba'!A25:B25","v":6},null,{"$f":"'Pracovní doba'!C25","v":"Čt"},{"$f":"IF('Pracovní doba'!D25=\"\",\"\",'Pracovní doba'!D25)","v":"P"},{"$f":"IF('Pracovní doba'!E25=\"\",\"\",'Pracovní doba'!E25)","v":"07:00:00"},{"$f":"IF('Pracovní doba'!F25=\"\",\"\",'Pracovní doba'!F25)","v":"11:00:00"},"-",{"$f":"IF('Pracovní doba'!H25=\"\",\"\",'Pracovní doba'!H25)","v":"11:30:00"},{"$f":"IF('Pracovní doba'!I25=\"\",\"\",'Pracovní doba'!I25)","v":"15:30:00"},{"$f":"IF('Pracovní doba'!J25=\"\",\"\",'Pracovní doba'!J25)","v":""},{"$f":"IF('Pracovní doba'!K25=\"\",\"\",'Pracovní doba'!K25)","v":""},{"$f":"IF('Pracovní doba'!L25=\"\",\"\",'Pracovní doba'!L25)","v":"08:00:00"},{"$f":"IF('Pracovní doba'!M25=\"\",\"\",'Pracovní doba'!M25)","v":""}]
[{"$f":"'Pracovní doba'!A26:B26","v":7},null,{"$f":"'Pracovní doba'!C26","v":"Pá"},{"$f":"IF('Pracovní doba'!D26=\"\",\"\",'Pracovní doba'!D26)","v":"P"},{"$f":"IF('Pracovní doba'!E26=\"\",\"\",'Pracovní doba'!E26)","v":"07:00:00"},{"$f":"IF('Pracovní doba'!F26=\"\",\"\",'Pracovní doba'!F26)","v":"11:00:00"},"-",{"$f":"IF('Pracovní doba'!H26=\"\",\"\",'Pracovní doba'!H26)","v":"11:30:00"},{"$f":"IF('Pracovní doba'!I26=\"\",\"\",'Pracovní doba'!I26)","v":"15:30:00"},{"$f":"IF('Pracovní doba'!J26=\"\",\"\",'Pracovní doba'!J26)","v":""},{"$f":"IF('Pracovní doba'!K26=\"\",\"\",'Pracovní doba'!K26)","v":""},{"$f":"IF('Pracovní doba'!L26=\"\",\"\",'Pracovní doba'!L26)","v":"08:00:00"},{"$f":"IF('Pracovní doba'!M26=\"\",\"\",'Pracovní doba'!M26)","v":""}]
[{"$f":"'Pracovní doba'!A27:B27","v":8},null,{"$f":"'Pracovní doba'!C27","v":"So"},{"$f":"IF('Pracovní doba'!D27=\"\",\"\",'Pracovní doba'!D27)","v":""},{"$f":"IF('Pracovní doba'!E27=\"\",\"\",'Pracovní doba'!E27)","v":""},{"$f":"IF('Pracovní doba'!F27=\"\",\"\",'Pracovní doba'!F27)","v":""},"-",{"$f":"IF('Pracovní doba'!H27=\"\",\"\",'Pracovní doba'!H27)","v":""},{"$f":"IF('Pracovní doba'!I27=\"\",\"\",'Pracovní doba'!I27)","v":""},{"$f":"IF('Pracovní doba'!J27=\"\",\"\",'Pracovní doba'!J27)","v":""},{"$f":"IF('Pracovní doba'!K27=\"\",\"\",'Pracovní doba'!K27)","v":""},{"$f":"IF('Pracovní doba'!L27=\"\",\"\",'Pracovní doba'!L27)","v":""},{"$f":"IF('Pracovní doba'!M27=\"\",\"\",'Pracovní doba'!M27)","v":""}]
[{"$f":"'Pracovní doba'!A28:B28","v":9},null,{"$f":"'Pracovní doba'!C28","v":"Ne"},{"$f":"IF('Pracovní doba'!D28=\"\",\"\",'Pracovní doba'!D28)","v":""},{"$f":"IF('Pracovní doba'!E28=\"\",\"\",'Pracovní doba'!E28)","v":""},{"$f":"IF('Pracovní doba'!F28=\"\",\"\",'Pracovní doba'!F28)","v":""},"-",{"$f":"IF('Pracovní doba'!H28=\"\",\"\",'Pracovní doba'!H28)","v":""},{"$f":"IF('Pracovní doba'!I28=\"\",\"\",'Pracovní doba'!I28)","v":""},{"$f":"IF('Pracovní doba'!J28=\"\",\"\",'Pracovní doba'!J28)","v":""},{"$f":"IF('Pracovní doba'!K28=\"\",\"\",'Pracovní doba'!K28)","v":""},{"$f":"IF('Pracovní doba'!L28=\"\",\"\",'Pracovní doba'!L28)","v":""},{"$f":"IF('Pracovní doba'!M28=\"\",\"\",'Pracovní doba'!M28)","v":""}]
[{"$f":"'Pracovní doba'!A29:B29","v":10},null,{"$f":"'Pracovní doba'!C29","v":"Po"},{"$f":"IF('Pracovní doba'!D29=\"\",\"\",'Pracovní doba'!D29)","v":"P"},{"$f":"IF('Pracovní doba'!E29=\"\",\"\",'Pracovní doba'!E29)","v":"07:00:00"},{"$f":"IF('Pracovní doba'!F29=\"\",\"\",'Pracovní doba'!F29)","v":"11:00:00"},"-",{"$f":"IF('Pracovní doba'!H29=\"\",\"\",'Pracovní doba'!H29)","v":"11:30:00"},{"$f":"IF('Pracovní doba'!I29=\"\",\"\",'Pracovní doba'!I29)","v":"15:30:00"},{"$f":"IF('Pracovní doba'!J29=\"\",\"\",'Pracovní doba'!J29)","v":""},{"$f":"IF('Pracovní doba'!K29=\"\",\"\",'Pracovní doba'!K29)","v":""},{"$f":"IF('Pracovní doba'!L29=\"\",\"\",'Pracovní doba'!L29)","v":"08:00:00"},{"$f":"IF('Pracovní doba'!M29=\"\",\"\",'Pracovní doba'!M29)","v":""}]
[{"$f":"'Pracovní doba'!A30:B30","v":11},null,{"$f":"'Pracovní doba'!C30","v":"Út"},{"$f":"IF('Pracovní doba'!D30=\"\",\"\",'Pracovní doba'!D30)","v":"P"},{"$f":"IF('Pracovní doba'!E30=\"\",\"\",'Pracovní doba'!E30)","v":"07:00:00"},{"$f":"IF('Pracovní doba'!F30=\"\",\"\",'Pracovní doba'!F30)","v":"11:00:00"},"-",{"$f":"IF('Pracovní doba'!H30=\"\",\"\",'Pracovní doba'!H30)","v":"11:30:00"},{"$f":"IF('Pracovní doba'!I30=\"\",\"\",'Pracovní doba'!I30)","v":"15:30:00"},{"$f":"IF('Pracovní doba'!J30=\"\",\"\",'Pracovní doba'!J30)","v":""},{"$f":"IF('Pracovní doba'!K30=\"\",\"\",'Pracovní doba'!K30)","v":""},{"$f":"IF('Pracovní doba'!L30=\"\",\"\",'Pracovní doba'!L30)","v":"08:00:00"},{"$f":"IF('Pracovní doba'!M30=\"\",\"\",'Pracovní doba'!M30)","v":""}]
[{"$f":"'Pracovní doba'!A31:B31","v":12},null,{"$f":"'Pracovní doba'!C31","v":"St"},{"$f":"IF('Pracovní doba'!D31=\"\",\"\",'Pracovní doba'!D31)","v":"P"},{"$f":"IF('Pracovní doba'!E31=\"\",\"\",'Pracovní doba'!E31)","v":"07:00:00"},{"$f":"IF('Pracovní doba'!F31=\"\",\"\",'Pracovní doba'!F31)","v":"11:00:00"},"-",{"$f":"IF('Pracovní doba'!H31=\"\",\"\",'Pracovní doba'!H31)","v":"11:30:00"},{"$f":"IF('Pracovní doba'!I31=\"\",\"\",'Pracovní doba'!I31)","v":"15:30:00"},{"$f":"IF('Pracovní doba'!J31=\"\",\"\",'Pracovní doba'!J31)","v":""},{"$f":"IF('Pracovní doba'!K31=\"\",\"\",'Pracovní doba'!K31)","v":""},{"$f":"IF('Pracovní doba'!L31=\"\",\"\",'Pracovní doba'!L31)","v":"08:00:00"},{"$f":"IF('Pracovní doba'!M31=\"\",\"\",'Pracovní doba'!M31)","v":""}]
[{"$f":"'Pracovní doba'!A32:B32","v":13},null,{"$f":"'Pracovní doba'!C32","v":"Čt"},{"$f":"IF('Pracovní doba'!D32=\"\",\"\",'Pracovní doba'!D32)","v":"P"},{"$f":"IF('Pracovní doba'!E32=\"\",\"\",'Pracovní doba'!E32)","v":"07:00:00"},{"$f":"IF('Pracovní doba'!F32=\"\",\"\",'Pracovní doba'!F32)","v":"11:00:00"},"-",{"$f":"IF('Pracovní doba'!H32=\"\",\"\",'Pracovní doba'!H32)","v":"11:30:00"},{"$f":"IF('Pracovní doba'!I32=\"\",\"\",'Pracovní doba'!I32)","v":"15:30:00"},{"$f":"IF('Pracovní doba'!J32=\"\",\"\",'Pracovní doba'!J32)","v":""},{"$f":"IF('Pracovní doba'!K32=\"\",\"\",'Pracovní doba'!K32)","v":""},{"$f":"IF('Pracovní doba'!L32=\"\",\"\",'Pracovní doba'!L32)","v":"08:00:00"},{"$f":"IF('Pracovní doba'!M32=\"\",\"\",'Pracovní doba'!M32)","v":""}]
[{"$f":"'Pracovní doba'!A33:B33","v":14},null,{"$f":"'Pracovní doba'!C33","v":"Pá"},{"$f":"IF('Pracovní doba'!D33=\"\",\"\",'Pracovní doba'!D33)","v":"P"},{"$f":"IF('Pracovní doba'!E33=\"\",\"\",'Pracovní doba'!E33)","v":"07:00:00"},{"$f":"IF('Pracovní doba'!F33=\"\",\"\",'Pracovní doba'!F33)","v":"11:00:00"},"-",{"$f":"IF('Pracovní doba'!H33=\"\",\"\",'Pracovní doba'!H33)","v":"11:30:00"},{"$f":"IF('Pracovní doba'!I33=\"\",\"\",'Pracovní doba'!I33)","v":"15:30:00"},{"$f":"IF('Pracovní doba'!J33=\"\",\"\",'Pracovní doba'!J33)","v":""},{"$f":"IF('Pracovní doba'!K33=\"\",\"\",'Pracovní doba'!K33)","v":""},{"$f":"IF('Pracovní doba'!L33=\"\",\"\",'Pracovní doba'!L33)","v":"08:00:00"},{"$f":"IF('Pracovní doba'!M33=\"\",\"\",'Pracovní doba'!M33)","v":""}]
[{"$f":"'Pracovní doba'!A34:B34","v":15},null,{"$f":"'Pracovní doba'!C34","v":"So"},{"$f":"IF('Pracovní doba'!D34=\"\",\"\",'Pracovní doba'!D34)","v":""},{"$f":"IF('Pracovní doba'!E34=\"\",\"\",'Pracovní doba'!E34)","v":""},{"$f":"IF('Pracovní doba'!F34=\"\",\"\",'Pracovní doba'!F34)","v":""},"-",{"$f":"IF('Pracovní doba'!H34=\"\",\"\",'Pracovní doba'!H34)","v":""},{"$f":"IF('Pracovní doba'!I34=\"\",\"\",'Pracovní doba'!I34)","v":""},{"$f":"IF('Pracovní doba'!J34=\"\",\"\",'Pracovní doba'!J34)","v":""},{"$f":"IF('Pracovní doba'!K34=\"\",\"\",'Pracovní doba'!K34)","v":""},{"$f":"IF('Pracovní doba'!L34=\"\",\"\",'Pracovní doba'!L34)","v":""},{"$f":"IF('Pracovní doba'!M34=\"\",\"\",'Pracovní doba'!M34)","v":""}]
[{"$f":"'Pracovní doba'!A35:B35","v":16},null,{"$f":"'Pracovní doba'!C35","v":"Ne"},{"$f":"IF('Pracovní doba'!D35=\"\",\"\",'Pracovní doba'!D35)","v":""},{"$f":"IF('Pracovní doba'!E35=\"\",\"\",'Pracovní doba'!E35)","v":""},{"$f":"IF('Pracovní doba'!F35=\"\",\"\",'Pracovní doba'!F35)","v":""},"-",{"$f":"IF('Pracovní doba'!H35=\"\",\"\",'Pracovní doba'!H35)","v":""},{"$f":"IF('Pracovní doba'!I35=\"\",\"\",'Pracovní doba'!I35)","v":""},{"$f":"IF('Pracovní doba'!J35=\"\",\"\",'Pracovní doba'!J35)","v":""},{"$f":"IF('Pracovní doba'!K35=\"\",\"\",'Pracovní doba'!K35)","v":""},{"$f":"IF('Pracovní doba'!L35=\"\",\"\",'Pracovní doba'!L35)","v":""},{"$f":"IF('Pracovní doba'!M35=\"\",\"\",'Pracovní doba'!M35)","v":""}]
[{"$f":"'Pracovní doba'!A36:B36","v":17},null,{"$f":"'Pracovní doba'!C36","v":"Po"},{"$f":"IF('Pracovní doba'!D36=\"\",\"\",'Pracovní doba'!D36)","v":"P"},{"$f":"IF('Pracovní doba'!E36=\"\",\"\",'Pracovní doba'!E36)","v":"07:00:00"},{"$f":"IF('Pracovní doba'!F36=\"\",\"\",'Pracovní doba'!F36)","v":"11:00:00"},"-",{"$f":"IF('Pracovní doba'!H36=\"\",\"\",'Pracovní doba'!H36)","v":"11:30:00"},{"$f":"IF('Pracovní doba'!I36=\"\",\"\",'Pracovní doba'!I36)","v":"15:30:00"},{"$f":"IF('Pracovní doba'!J36=\"\",\"\",'Pracovní doba'!J36)","v":""},{"$f":"IF('Pracovní doba'!K36=\"\",\"\",'Pracovní doba'!K36)","v":""},{"$f":"IF('Pracovní doba'!L36=\"\",\"\",'Pracovní doba'!L36)","v":"08:00:00"},{"$f":"IF('Pracovní doba'!M36=\"\",\"\",'Pracovní doba'!M36)","v":""}]
[{"$f":"'Pracovní doba'!A37:B37","v":18},null,{"$f":"'Pracovní doba'!C37","v":"Út"},{"$f":"IF('Pracovní doba'!D37=\"\",\"\",'Pracovní doba'!D37)","v":"P"},{"$f":"IF('Pracovní doba'!E37=\"\",\"\",'Pracovní doba'!E37)","v":"07:00:00"},{"$f":"IF('Pracovní doba'!F37=\"\",\"\",'Pracovní doba'!F37)","v":"11:00:00"},"-",{"$f":"IF('Pracovní doba'!H37=\"\",\"\",'Pracovní doba'!H37)","v":"11:30:00"},{"$f":"IF('Pracovní doba'!I37=\"\",\"\",'Pracovní doba'!I37)","v":"15:30:00"},{"$f":"IF('Pracovní doba'!J37=\"\",\"\",'Pracovní doba'!J37)","v":""},{"$f":"IF('Pracovní doba'!K37=\"\",\"\",'Pracovní doba'!K37)","v":""},{"$f":"IF('Pracovní doba'!L37=\"\",\"\",'Pracovní doba'!L37)","v":"08:00:00"},{"$f":"IF('Pracovní doba'!M37=\"\",\"\",'Pracovní doba'!M37)","v":""}]
[{"$f":"'Pracovní doba'!A38:B38","v":19},null,{"$f":"'Pracovní doba'!C38","v":"St"},{"$f":"IF('Pracovní doba'!D38=\"\",\"\",'Pracovní doba'!D38)","v":"P"},{"$f":"IF('Pracovní doba'!E38=\"\",\"\",'Pracovní doba'!E38)","v":"07:00:00"},{"$f":"IF('Pracovní doba'!F38=\"\",\"\",'Pracovní doba'!F38)","v":"11:00:00"},"-",{"$f":"IF('Pracovní doba'!H38=\"\",\"\",'Pracovní doba'!H38)","v":"11:30:00"},{"$f":"IF('Pracovní doba'!I38=\"\",\"\",'Pracovní doba'!I38)","v":"15:30:00"},{"$f":"IF('Pracovní doba'!J38=\"\",\"\",'Pracovní doba'!J38)","v":""},{"$f":"IF('Pracovní doba'!K38=\"\",\"\",'Pracovní doba'!K38)","v":""},{"$f":"IF('Pracovní doba'!L38=\"\",\"\",'Pracovní doba'!L38)","v":"08:00:00"},{"$f":"IF('Pracovní doba'!M38=\"\",\"\",'Pracovní doba'!M38)","v":""}]
[{"$f":"'Pracovní doba'!A39:B39","v":20},null,{"$f":"'Pracovní doba'!C39","v":"Čt"},{"$f":"IF('Pracovní doba'!D39=\"\",\"\",'Pracovní doba'!D39)","v":"P"},{"$f":"IF('Pracovní doba'!E39=\"\",\"\",'Pracovní doba'!E39)","v":"07:00:00"},{"$f":"IF('Pracovní doba'!F39=\"\",\"\",'Pracovní doba'!F39)","v":"11:00:00"},"-",{"$f":"IF('Pracovní doba'!H39=\"\",\"\",'Pracovní doba'!H39)","v":"11:30:00"},{"$f":"IF('Pracovní doba'!I39=\"\",\"\",'Pracovní doba'!I39)","v":"15:30:00"},{"$f":"IF('Pracovní doba'!J39=\"\",\"\",'Pracovní doba'!J39)","v":""},{"$f":"IF('Pracovní doba'!K39=\"\",\"\",'Pracovní doba'!K39)","v":""},{"$f":"IF('Pracovní doba'!L39=\"\",\"\",'Pracovní doba'!L39)","v":"08:00:00"},{"$f":"IF('Pracovní doba'!M39=\"\",\"\",'Pracovní doba'!M39)","v":""}]
[{"$f":"'Pracovní doba'!A40:B40","v":21},null,{"$f":"'Pracovní doba'!C40","v":"Pá"},{"$f":"IF('Pracovní doba'!D40=\"\",\"\",'Pracovní doba'!D40)","v":"P"},{"$f":"IF('Pracovní doba'!E40=\"\",\"\",'Pracovní doba'!E40)","v":"07:00:00"},{"$f":"IF('Pracovní doba'!F40=\"\",\"\",'Pracovní doba'!F40)","v":"11:00:00"},"-",{"$f":"IF('Pracovní doba'!H40=\"\",\"\",'Pracovní doba'!H40)","v":"11:30:00"},{"$f":"IF('Pracovní doba'!I40=\"\",\"\",'Pracovní doba'!I40)","v":"15:30:00"},{"$f":"IF('Pracovní doba'!J40=\"\",\"\",'Pracovní doba'!J40)","v":""},{"$f":"IF('Pracovní doba'!K40=\"\",\"\",'Pracovní doba'!K40)","v":""},{"$f":"IF('Pracovní doba'!L40=\"\",\"\",'Pracovní doba'!L40)","v":"08:00:00"},{"$f":"IF('Pracovní doba'!M40=\"\",\"\",'Pracovní doba'!M40)","v":""}]
[{"$f":"'Pracovní doba'!A41:B41","v":22},null,{"$f":"'Pracovní doba'!C41","v":"So"},{"$f":"IF('Pracovní doba'!D41=\"\",\"\",'Pracovní doba'!D41)","v":""},{"$f":"IF('Pracovní doba'!E41=\"\",\"\",'Pracovní doba'!E41)","v":""},{"$f":"IF('Pracovní doba'!F41=\"\",\"\",'Pracovní doba'!F41)","v":""},"-",{"$f":"IF('Pracovní doba'!H41=\"\",\"\",'Pracovní doba'!H41)","v":""},{"$f":"IF('Pracovní doba'!I41=\"\",\"\",'Pracovní doba'!I41)","v":""},{"$f":"IF('Pracovní doba'!J41=\"\",\"\",'Pracovní doba'!J41)","v":""},{"$f":"IF('Pracovní doba'!K41=\"\",\"\",'Pracovní doba'!K41)","v":""},{"$f":"IF('Pracovní doba'!L41=\"\",\"\",'Pracovní doba'!L41)","v":""},{"$f":"IF('Pracovní doba'!M41=\"\",\"\",'Pracovní doba'!M41)","v":""}]
[{"$f":"'Pracovní doba'!A42:B42","v":23},null,{"$f":"'Pracovní doba'!C42","v":"Ne"},{"$f":"IF('Pracovní doba'!D42=\"\",\"\",'Pracovní doba'!D42)","v":""},{"$f":"IF('Pracovní doba'!E42=\"\",\"\",'Pracovní doba'!E42)","v":""},{"$f":"IF('Pracovní doba'!F42=\"\",\"\",'Pracovní doba'!F42)","v":""},"-",{"$f":"IF('Pracovní doba'!H42=\"\",\"\",'Pracovní doba'!H42)","v":""},{"$f":"IF('Pracovní doba'!I42=\"\",\"\",'Pracovní doba'!I42)","v":""},{"$f":"IF('Pracovní doba'!J42=\"\",\"\",'Pracovní doba'!J42)","v":""},{"$f":"IF('Pracovní doba'!K42=\"\",\"\",'Pracovní doba'!K42)","v":""},{"$f":"IF('Pracovní doba'!L42=\"\",\"\",'Pracovní doba'!L42)","v":""},{"$f":"IF('Pracovní doba'!M42=\"\",\"\",'Pracovní doba'!M42)","v":""}]
[{"$f":"'Pracovní doba'!A43:B43","v":24},null,{"$f":"'Pracovní doba'!C43","v":"Po"},{"$f":"IF('Pracovní doba'!D43=\"\",\"\",'Pracovní doba'!D43)","v":"P"},{"$f":"IF('Pracovní doba'!E43=\"\",\"\",'Pracovní doba'!E43)","v":"07:00:00"},{"$f":"IF('Pracovní doba'!F43=\"\",\"\",'Pracovní doba'!F43)","v":"11:00:00"},"-",{"$f":"IF('Pracovní doba'!H43=\"\",\"\",'Pracovní doba'!H43)","v":"11:30:00"},{"$f":"IF('Pracovní doba'!I43=\"\",\"\",'Pracovní doba'!I43)","v":"15:30:00"},{"$f":"IF('Pracovní doba'!J43=\"\",\"\",'Pracovní doba'!J43)","v":""},{"$f":"IF('Pracovní doba'!K43=\"\",\"\",'Pracovní doba'!K43)","v":""},{"$f":"IF('Pracovní doba'!L43=\"\",\"\",'Pracovní doba'!L43)","v":"08:00:00"},{"$f":"IF('Pracovní doba'!M43=\"\",\"\",'Pracovní doba'!M43)","v":""}]
[{"$f":"'Pracovní doba'!A44:B44","v":25},null,{"$f":"'Pracovní doba'!C44","v":"Út"},{"$f":"IF('Pracovní doba'!D44=\"\",\"\",'Pracovní doba'!D44)","v":"P"},{"$f":"IF('Pracovní doba'!E44=\"\",\"\",'Pracovní doba'!E44)","v":"07:00:00"},{"$f":"IF('Pracovní doba'!F44=\"\",\"\",'Pracovní doba'!F44)","v":"11:00:00"},"-",{"$f":"IF('Pracovní doba'!H44=\"\",\"\",'Pracovní doba'!H44)","v":"11:30:00"},{"$f":"IF('Pracovní doba'!I44=\"\",\"\",'Pracovní doba'!I44)","v":"15:30:00"},{"$f":"IF('Pracovní doba'!J44=\"\",\"\",'Pracovní doba'!J44)","v":""},{"$f":"IF('Pracovní doba'!K44=\"\",\"\",'Pracovní doba'!K44)","v":""},{"$f":"IF('Pracovní doba'!L44=\"\",\"\",'Pracovní doba'!L44)","v":"08:00:00"},{"$f":"IF('Pracovní doba'!M44=\"\",\"\",'Pracovní doba'!M44)","v":""}]
[{"$f":"'Pracovní doba'!A45:B45","v":26},null,{"$f":"'Pracovní doba'!C45","v":"St"},{"$f":"IF('Pracovní doba'!D45=\"\",\"\",'Pracovní doba'!D45)","v":"P"},{"$f":"IF('Pracovní doba'!E45=\"\",\"\",'Pracovní doba'!E45)","v":"07:00:00"},{"$f":"IF('Pracovní doba'!F45=\"\",\"\",'Pracovní doba'!F45)","v":"11:00:00"},"-",{"$f":"IF('Pracovní doba'!H45=\"\",\"\",'Pracovní doba'!H45)","v":"11:30:00"},{"$f":"IF('Pracovní doba'!I45=\"\",\"\",'Pracovní doba'!I45)","v":"15:30:00"},{"$f":"IF('Pracovní doba'!J45=\"\",\"\",'Pracovní doba'!J45)","v":""},{"$f":"IF('Pracovní doba'!K45=\"\",\"\",'Pracovní doba'!K45)","v":""},{"$f":"IF('Pracovní doba'!L45=\"\",\"\",'Pracovní doba'!L45)","v":"08:00:00"},{"$f":"IF('Pracovní doba'!M45=\"\",\"\",'Pracovní doba'!M45)","v":""}]
[{"$f":"'Pracovní doba'!A46:B46","v":27},null,{"$f":"'Pracovní doba'!C46","v":"Čt"},{"$f":"IF('Pracovní doba'!D46=\"\",\"\",'Pracovní doba'!D46)","v":"P"},{"$f":"IF('Pracovní doba'!E46=\"\",\"\",'Pracovní doba'!E46)","v":"07:00:00"},{"$f":"IF('Pracovní doba'!F46=\"\",\"\",'Pracovní doba'!F46)","v":"11:00:00"},"-",{"$f":"IF('Pracovní doba'!H46=\"\",\"\",'Pracovní doba'!H46)","v":"11:30:00"},{"$f":"IF('Pracovní doba'!I46=\"\",\"\",'Pracovní doba'!I46)","v":"15:30:00"},{"$f":"IF('Pracovní doba'!J46=\"\",\"\",'Pracovní doba'!J46)","v":""},{"$f":"IF('Pracovní doba'!K46=\"\",\"\",'Pracovní doba'!K46)","v":""},{"$f":"IF('Pracovní doba'!L46=\"\",\"\",'Pracovní doba'!L46)","v":"08:00:00"},{"$f":"IF('Pracovní doba'!M46=\"\",\"\",'Pracovní doba'!M46)","v":""}]
[{"$f":"'Pracovní doba'!A47:B47","v":28},null,{"$f":"'Pracovní doba'!C47","v":"Pá"},{"$f":"IF('Pracovní doba'!D47=\"\",\"\",'Pracovní doba'!D47)","v":"P"},{"$f":"IF('Pracovní doba'!E47=\"\",\"\",'Pracovní doba'!E47)","v":"07:00:00"},{"$f":"IF('Pracovní doba'!F47=\"\",\"\",'Pracovní doba'!F47)","v":"11:00:00"},"-",{"$f":"IF('Pracovní doba'!H47=\"\",\"\",'Pracovní doba'!H47)","v":"11:30:00"},{"$f":"IF('Pracovní doba'!I47=\"\",\"\",'Pracovní doba'!I47)","v":"15:30:00"},{"$f":"IF('Pracovní doba'!J47=\"\",\"\",'Pracovní doba'!J47)","v":""},{"$f":"IF('Pracovní doba'!K47=\"\",\"\",'Pracovní doba'!K47)","v":""},{"$f":"IF('Pracovní doba'!L47=\"\",\"\",'Pracovní doba'!L47)","v":"08:00:00"},{"$f":"IF('Pracovní doba'!M47=\"\",\"\",'Pracovní doba'!M47)","v":""}]
[{"$f":"'Pracovní doba'!A48:B48","v":29},null,{"$f":"'Pracovní doba'!C48","v":"So"},{"$f":"IF('Pracovní doba'!D48=\"\",\"\",'Pracovní doba'!D48)","v":""},{"$f":"IF('Pracovní doba'!E48=\"\",\"\",'Pracovní doba'!E48)","v":""},{"$f":"IF('Pracovní doba'!F48=\"\",\"\",'Pracovní doba'!F48)","v":""},"-",{"$f":"IF('Pracovní doba'!H48=\"\",\"\",'Pracovní doba'!H48)","v":""},{"$f":"IF('Pracovní doba'!I48=\"\",\"\",'Pracovní doba'!I48)","v":""},{"$f":"IF('Pracovní doba'!J48=\"\",\"\",'Pracovní doba'!J48)","v":""},{"$f":"IF('Pracovní doba'!K48=\"\",\"\",'Pracovní doba'!K48)","v":""},{"$f":"IF('Pracovní doba'!L48=\"\",\"\",'Pracovní doba'!L48)","v":""},{"$f":"IF('Pracovní doba'!M48=\"\",\"\",'Pracovní doba'!M48)","v":""}]
[{"$f":"'Pracovní doba'!A49:B49","v":30},null,{"$f":"'Pracovní doba'!C49","v":"Ne"},{"$f":"IF('Pracovní doba'!D49=\"\",\"\",'Pracovní doba'!D49)","v":""},{"$f":"IF('Pracovní doba'!E49=\"\",\"\",'Pracovní doba'!E49)","v":""},{"$f":"IF('Pracovní doba'!F49=\"\",\"\",'Pracovní doba'!F49)","v":""},"-",{"$f":"IF('Pracovní doba'!H49=\"\",\"\",'Pracovní doba'!H49)","v":""},{"$f":"IF('Pracovní doba'!I49=\"\",\"\",'Pracovní doba'!I49)","v":""},{"$f":"IF('Pracovní doba'!J49=\"\",\"\",'Pracovní doba'!J49)","v":""},{"$f":"IF('Pracovní doba'!K49=\"\",\"\",'Pracovní doba'!K49)","v":""},{"$f":"IF('Pracovní doba'!L49=\"\",\"\",'Pracovní doba'!L49)","v":""},{"$f":"IF('Pracovní doba'!M49=\"\",\"\",'Pracovní doba'!M49)","v":""}]
[{"$f":"'Pracovní doba'!A50:B50","v":31},null,{"$f":"'Pracovní doba'!C50","v":"Po"},{"$f":"IF('Pracovní doba'!D50=\"\",\"\",'Pracovní doba'!D50)","v":"P"},{"$f":"IF('Pracovní doba'!E50=\"\",\"\",'Pracovní doba'!E50)","v":"07:00:00"},{"$f":"IF('Pracovní doba'!F50=\"\",\"\",'Pracovní doba'!F50)","v":"11:00:00"},"-",{"$f":"IF('Pracovní doba'!H50=\"\",\"\",'Pracovní doba'!H50)","v":"11:30:00"},{"$f":"IF('Pracovní doba'!I50=\"\",\"\",'Pracovní doba'!I50)","v":"15:30:00"},{"$f":"IF('Pracovní doba'!J50=\"\",\"\",'Pracovní doba'!J50)","v":""},{"$f":"IF('Pracovní doba'!K50=\"\",\"\",'Pracovní doba'!K50)","v":""},{"$f":"IF('Pracovní doba'!L50=\"\",\"\",'Pracovní doba'!L50)","v":"08:00:00"},{"$f":"IF('Pracovní doba'!M50=\"\",\"\",'Pracovní doba'!M50)","v":""}]
[]
[null,null,null,null,null,null,null,null,null,null,"fond pracovní doby",null,{"$f":"'Pracovní doba'!M52","v":168}]
[null,null,null,null,null,null,null,null,null,null,"odpracováno vč. SC a svátek",null,{"$f":"'Pracovní doba'!M53","v":167.99999999999994}]
[null,null,null,null,null,null,null,null,null,null,"z toho přímá pedag. činnost",null,{"$f":"'Pracovní doba'!M54","v":0}]
[null,null,null,null,null,null,null,null,null,null,"neodpracováno",null,{"$f":"'Pracovní doba'!M55","v":0}]
[null,null,null,null,null,null,null,null,null,null,"kontrola",null,{"$f":"'Pracovní doba'!M56","v":0}]
["Datum a podpis zaměstnance:"]
[]
[]
[]
["Datum a podpis nadřízeného pracovníka:"]

{"sheet":"typ dne","index":2,"n_rows":61,"n_cols":26,"rows_kept":61,"cut":false,"hidden":true,"merged":[]}
[null,null,"Po","Út","St","Čt","Pá","So","Ne",null,null,null,null,null,null,null,null,null,null,null,null,null,null,"NS","Název pracoviště","NS"]
["§","placený paragraf ","§","§","§","§","§","P","P",null,1,2,3,4,5,6,7,null,1,2019,{"$f":"DATE(T2,S2,1)","v":"2019-01-01"},184,null,"090800","Děkanát","090800"]
["D","dovolená","D","D","D","D","D",null,null,null,"Po","Út","St","Čt","Pá","So","Ne",null,2,2019,"2019-02-01",1690,null,"090812","Ekonomické pracoviště","090812"]
["IV","indispoziční volno","IV","IV","IV","IV","IV",null,null,null,null,null,null,null,null,null,null,null,3,2019,"2019-03-01",168,null,"090053","Experimentální rybochovné pracoviště a pokusnictví","090053"]
["L","lékař","L","L","L","L","L",null,null,null,null,null,null,null,null,null,null,null,4,2019,"2019-04-01",176,null,"090052","Genetické rybářské centrum","090052"]
["MD","mateřská dovolená","MD","MD","MD","MD","MD",null,null,null,null,null,null,null,null,null,null,null,5,2019,"2019-05-01",184,null,"092410","Kancelář CENAKVA","092410"]
["N","nemoc","N","N","N","N","N",null,null,null,null,null,null,null,null,null,null,null,6,2019,"2019-06-01",160,null,"090811","Kancelář děkana","090811"]
["NpV","neplacené volno","NpV","NpV","NpV","NpV","NpV",null,null,null,null,null,null,null,null,null,null,null,7,2019,"2019-07-01",184,null,"090119","Kancelář ÚAOV","090119"]
["NV","náhradní volno","NV","NV","NV","NV","NV",null,null,null,null,null,null,null,null,null,null,null,8,2019,"2019-08-01",176,null,"090219","Kancelář ÚKS","090219"]
["OČR","ošetřování člena rodiny","OČR","OČR","OČR","OČR","OČR",null,null,null,null,null,null,null,null,null,null,null,9,2019,"2019-09-01",168,null,"090019","Kancelář VÚRH","090019"]
["OPP","otcovská poporodní péče","OPP","OPP","OPP","OPP","OPP",null,null,null,null,null,null,null,null,null,null,null,10,2019,"2019-10-01",184,null,"090031","Laboratoř environmentální chemie a biochemie","090031"]
["P","odpracovaná doba","P","P","P","P","P",null,null,null,null,null,null,null,null,null,null,null,11,2019,"2019-11-01",168,null,"090211","Laboratoř experimentálních komplexních systémů","090211"]
["RD","rodičovská dovolená","RD","RD","RD","RD","RD",null,null,null,null,null,null,null,null,null,null,null,12,2019,"2019-12-01",176,null,"090021","Laboratoř fyziologie reprodukce","090021"]
["S","svátek","S","S","S","S","S",null,null,null,null,null,null,null,null,null,null,null,1,2020,"2020-01-01",184,null,"090012","Laboratoř intenzivní akvakultury","090012"]
["SC","služební cesta","SC","SC","SC","SC","SC",null,null,null,null,null,null,null,null,null,null,null,2,2020,"2020-02-01",160,null,"090022","Laboratoř molekulární buněčné a kvantitativní genetiky","090022"]
[null,null,null,null,null,null,null,null,null,null,null,null,null,null,null,null,null,null,3,2020,"2020-03-01",176,null,"090171","Laboratoř řízené reprodukce a intenzivního chovu ryb","090171"]
[null,null,null,null,null,null,null,null,null,null,null,null,null,null,null,null,null,null,4,2020,"2020-04-01",176,null,"090011","Laboratoř sladkovodních ekosystémů","090011"]
[null,null,null,null,null,null,null,null,null,null,null,null,null,null,null,null,null,null,5,2020,"2020-05-01",168,null,"090032","Laboratoř vodní toxikologie a ichtyopatologie","090032"]
[null,null,null,null,null,null,null,null,null,null,null,null,null,null,null,null,null,null,6,2020,"2020-06-01",176,null,"090191","Laboratoř výživy","090191"]
[null,null,null,null,null,null,null,null,null,null,null,null,null,null,null,null,null,null,7,2020,"2020-07-01",184,null,"090023","Laboratoř zárodečných buněk","090023"]
[null,null,null,null,null,null,null,null,null,null,null,null,null,null,null,null,null,null,8,2020,"2020-08-01",168,null,"090213","Laboratoř zpracování signálu a obrazu","090213"]
[null,null,null,null,null,null,null,null,null,null,null,null,null,null,null,null,null,null,9,2020,"2020-09-01",176,null,"090817","MEVPIS","090817"]
[null,null,null,null,null,null,null,null,null,null,null,null,null,null,null,null,null,null,10,2020,"2020-10-01",176,null,"090814","Pracoviště správy a údržby majetku","090814"]
[null,null,null,null,null,null,null,null,null,null,null,null,null,null,null,null,null,null,11,2020,"2020-11-01",168,null,"090821","Pracoviště vědy a výzkumu","090821"]
[null,null,null,null,null,null,null,null,null,null,null,null,null,null,null,null,null,null,12,2020,"2020-12-01",184,null,"090815","Pracoviště zahraničních vztahů","090815"]
[null,null,null,null,null,null,null,null,null,null,null,null,null,null,null,null,null,null,1,2022,"2022-01-01",168,null,"090827","Projektové pracoviště","090827"]
[null,null,null,null,null,null,null,null,null,null,null,null,null,null,null,null,null,null,2,2022,"2022-02-01",160,null,"090824","Redakční rada a knihovna","090824"]
[null,null,null,null,null,null,null,null,null,null,null,null,null,null,null,null,null,null,3,2022,"2022-03-01",184,null,"090813","Studijní pracoviště","090813"]
[null,null,null,null,null,null,null,null,null,null,null,null,null,null,null,null,null,null,4,2022,"2022-04-01",168,null,"090801","Úsek děkana","090801"]
[null,null,null,null,null,null,null,null,null,null,null,null,null,null,null,null,null,null,5,2022,"2022-05-01",176,null,"090807","Úsek manažerský","090807"]
[null,null,null,null,null,null,null,null,null,null,null,null,null,null,null,null,null,null,6,2022,"2022-06-01",176,null,"090803","Úsek proděkana pro pedagogickou činnost","090803"]
[null,null,null,null,null,null,null,null,null,null,null,null,null,null,null,null,null,null,7,2022,"2022-07-01",168,null,"090806","Úsek proděkana pro rozvoj","090806"]
[null,null,null,null,null,null,null,null,null,null,null,null,null,null,null,null,null,null,8,2022,"2022-08-01",184,null,"090804","Úsek proděkana pro vědu a výzkum","090804"]
[null,null,null,null,null,null,null,null,null,null,null,null,null,null,null,null,null,null,9,2022,"2022-09-01",176,null,"090805","Úsek proděkana pro zahraniční vztahy","090805"]
[null,null,null,null,null,null,null,null,null,null,null,null,null,null,null,null,null,null,10,2022,"2022-10-01",168,null,"090802","Úsek tajemníka fakulty","090802"]
[null,null,null,null,null,null,null,null,null,null,null,null,null,null,null,null,null,null,11,2022,"2022-11-01",176,null,"090110","Ústav akvakultury a ochrany vod","090110"]
[null,null,null,null,null,null,null,null,null,null,null,null,null,null,null,null,null,null,12,2022,"2022-12-01",176,null,"090210","Ústav komplexních systémů","090210"]
[null,null,null,null,null,null,null,null,null,null,null,null,null,null,null,null,null,null,1,2023,"2023-01-01",176,null,"092401","VP 1 - Reprodukční a genetické postupy pro uchování biodiverzity ryb a akvakulturu","092401"]
[null,null,null,null,null,null,null,null,null,null,null,null,null,null,null,null,null,null,2,2023,"2023-02-01",160,null,"092402","VP 2 - \"Nové\" polutanty v životním prostředí a jejich vliv na ekosystémy","092402"]
[null,null,null,null,null,null,null,null,null,null,null,null,null,null,null,null,null,null,3,2023,"2023-03-01",184,null,"092403","VP 3 - Dlouhodobě udržitelná akvakultura s odpovědným hospodařením s vodou a živinami","092403"]
[null,null,null,null,null,null,null,null,null,null,null,null,null,null,null,null,null,null,4,2023,"2023-04-01",160,null,"092404","VP 4 - Sladkovodní ekosystémy v éře globálních změn","092404"]
[null,null,null,null,null,null,null,null,null,null,null,null,null,null,null,null,null,null,5,2023,"2023-05-01",184,null,"090010","Výzkumný ústav rybářský a hydrobiologický","090010"]
[null,null,null,null,null,null,null,null,null,null,null,null,null,null,null,null,null,null,6,2023,"2023-06-01",176,null,"090121","Zpracovna a prodejna ryb a produktů akvakultury","090121"]
[null,null,null,null,null,null,null,null,null,null,null,null,null,null,null,null,null,null,7,2023,"2023-07-01",168]
[null,null,null,null,null,null,null,null,null,null,null,null,null,null,null,null,null,null,8,2023,"2023-08-01",184]
[null,null,null,null,null,null,null,null,null,null,null,null,null,null,null,null,null,null,9,2023,"2023-09-01",168]
[null,null,null,null,null,null,null,null,null,null,null,null,null,null,null,null,null,null,10,2023,"2023-10-01",176]
[null,null,null,null,null,null,null,null,null,null,null,null,null,null,null,null,null,null,11,2023,"2023-11-01",176]
[null,null,null,null,null,null,null,null,null,null,null,null,null,null,null,null,null,null,12,2023,"2023-12-01",168]
[null,null,null,null,null,null,null,null,null,null,null,null,null,null,null,null,null,null,1,2021,"2021-01-01",168]
[null,null,null,null,null,null,null,null,null,null,null,null,null,null,null,null,null,null,2,2021,"2021-02-01",160]
[null,null,null,null,null,null,null,null,null,null,null,null,null,null,null,null,null,null,3,2021,"2021-03-01",184]
[null,null,null,null,null,null,null,null,null,null,null,null,null,null,null,null,null,null,4,2021,"2021-04-01",176]
[null,null,null,null,null,null,null,null,null,null,null,null,null,null,null,null,null,null,5,2021,"2021-05-01",168]
[null,null,null,null,null,null,null,null,null,null,null,null,null,null,null,null,null,null,6,2021,"2021-06-01",176]
[null,null,null,null,null,null,null,null,null,null,null,null,null,null,null,null,null,null,7,2021,"2021-07-01",176]
[null,null,null,null,null,null,null,null,null,null,null,null,null,null,null,null,null,null,8,2021,"2021-08-01",176]
[null,null,null,null,null,null,null,null,null,null,null,null,null,null,null,null,null,null,9,2021,"2021-09-01",176]
[null,null,null,null,null,null,null,null,null,null,null,null,null,null,null,null,null,null,10,2021,"2021-10-01",168]
[null,null,null,null,null,null,null,null,null,null,null,null,null,null,null,null,null,null,11,2021,"2021-11-01",176]
[null,null,null,null,null,null,null,null,null,null,null,null,null,null,null,null,null,null,12,2021,"2021-12-01",184]

{"sheet":"List1","index":3,"n_rows":24,"n_cols":2,"rows_kept":24,"cut":false,"hidden":true,"merged":[]}
["01:00:00",1]
["02:00:00",2]
["03:00:00",3]
["04:00:00",4]
["05:00:00",5]
["06:00:00",6]
["07:00:00",7]
["08:00:00",8]
["09:00:00",9]
["10:00:00",10]
["11:00:00",11]
["12:00:00",12]
["13:00:00",13]
["14:00:00",14]
["15:00:00",15]
["16:00:00",16]
["17:00:00",17]
["18:00:00",18]
["19:00:00",19]
["20:00:00",20]
["21:00:00",21]
["22:00:00",22]
["23:00:00",23]
[1,0]