{"text_format":"1","workbook":"xlsx","n_sheets":4,"sheets":["Pracovní doba","PD_FORMULÁŘ","typ dne","List1"],"not_rendered":{"charts":0,"images":1,"macros":1,"external_links":0,"defined_names":27,"comments":1,"pivot_tables":0},"unopened":[],"bounds":{"document_bytes":16777216,"sheet_cells":100000,"rows_first":2000,"rows_last":500,"rows_between":2000,"halvings":0,"cell_chars":16384,"cell_head_chars":4096},"cells_cut":0,"cells_raw":0,"read":"whole","date_system":"1900"}

{"sheet":"Pracovní doba","index":0,"n_rows":61,"n_cols":40,"rows_kept":61,"cut":false,"hidden":false,"merged":[[51,10,51,11],[52,10,52,11],[53,10,53,11],[54,10,54,11],[0,4,0,5],[1,4,1,5],[13,4,13,8],[8,0,8,9],[10,4,10,8],[10,0,11,3],[11,4,11,8],[26,0,26,1],[27,0,27,1],[28,0,28,1],[29,0,29,1],[15,4,15,8],[21,0,21,1],[22,0,22,1],[23,0,23,1],[24,0,24,1],[19,0,19,1],[20,0,20,1],[25,0,25,1],[36,0,36,1],[37,0,37,1],[38,0,38,1],[39,0,39,1],[30,0,30,1],[40,0,40,1],[31,0,31,1],[32,0,32,1],[33,0,33,1],[34,0,34,1],[35,0,35,1],[49,0,49,1],[48,0,48,1],[41,0,41,1],[46,0,46,1],[47,0,47,1],[43,0,43,1],[44,0,44,1],[45,0,45,1],[42,0,42,1],[17,13,18,13],[17,14,18,14],[17,11,17,12],[13,0,13,3],[17,0,18,2],[17,3,18,3],[17,4,18,4],[17,5,18,7],[17,8,18,8],[17,9,18,9],[17,10,18,10],[15,0,15,3]]}
[null,null,null,"Měsíc:",1]
[null,null,null,"Rok:",2022]
[null,null,null,"Dnů v měsící:",{"$f":"VALUE(DAY(DATE($E$2,$E$1+1,1)-DATE($E$2,$E$1,1)))","v":31}]
[null,null,null,"Příchod:","07:00:00"]
[null,null,null,"Přestávka:","11:00:00",{"$f":"IF(E5=\"\",\"\",E5+1/48)","v":"11:30:00"},"11:30:00"]
[null,null,null,"Odchod:","15:30:00"]
[null,null,null,"MAX:",{"$f":"1/24*22","v":"22:00:00"}]
[]
["Evidence pracovní doby"]
[]
["Útvar/NS"]
[null,null,null,null,{"$f":"IF(ISERROR(VLOOKUP(E11,'typ dne'!Y:Z,2,0)),\"\",VLOOKUP(E11,'typ dne'!Y:Z,2,0))","v":""}]
[]
["Jméno",null,null,null,null,null,null,null,null,"Období",{"$f":"DATE(E2,E1,1)","v":"2022-01-01"}]
[]
["Osobní číslo zaměstnance",null,null,null,null,null,null,null,null,"Úvazek",1]
[]
["Den",null,null,"TYP dne","Příchod","Pracovní přestávka na jídlo a oddech",null,null,"Odchod","Speciální den (vyplňuje se automaticky v závislosti na TYP dne)","Poznámka (V případě potřeby, SC kratší než 1 den apod…)","Odpracováno ",null,"Délka nepřetržitého odpočinku (min 35h)","Přestávka     na jídlo                 (max. po 6h)"]
[null,null,null,null,null,null,null,null,null,null,null,"Celkem       (vč. \"S\" a \"SC\")","z toho        přímá pedag. činnost",null,null,"Odpracováno","Neodpracováno","PŘESTÁVKA","ODPRACOVÁNO","Počet H od půlnoci","Počet H do půlnoci","Den volna","Hodiny volna do začátku směny (v rámic 24 h)","Hodiny volna do začátku směny (celkem)",null,"Nápověda"]
[1,null,{"$f":"IF(A20=\"\",A20,HLOOKUP(WEEKDAY(DATE(rok,mesic,A20),2),tyden,2))","v":"So"},{"$f":"IF(OR(A20=\"\",C20=\"So\",C20=\"Ne\"),\"\",\"P\")","v":""},{"$f":"IF(D20=\"\",\"\",IF(D20=\"P\",prichod,\"\"))","v":""},{"$f":"IF(D20=\"\",\"\",IF(prestavka=\"\",\"\",IF(D20=\"P\",prestavka,\"\")))","v":""},"-",{"$f":"IF(F20=\"\",\"\",F20+1/48)","v":""},{"$f":"IF(D20=\"\",\"\",IF(D20=\"P\",odchod,\"\"))","v":""},{"$f":"IF(D20=\"\",\"\",IF(D20=\"P\",\"\",VLOOKUP(D20,vyjímky,2)))","v":""},null,{"$f":"IF(OR(D20=\"SC\",D20=\"S\"),(1/3)*uvazek,IF(D20=\"P\",IF(P20=\"\",\"\",P20/24),\"\"))","v":""},null,{"$f":"IF(C17=\"Po\",IF(C24=\"Ne\",MAX(X19:X25),\"\"),\"\")","v":""},{"$f":"IF(ISERROR(R20),\"\",R20)","v":""},{"$f":"IF(D20=\"\",\"\",IF(F20=\"\",(HOUR(I20)+MINUTE(I20)/60)-(HOUR(E20)+MINUTE(E20)/60),IF(OR(D20=\"SC\",D20=\"S\"),(1/3)*uvazek,IF(E20=\"\",\"\",(IF(D20=\"\",\"\",(IF(I20=\"\",0,(HOUR(I20)+MINUTE(I20)/60))-IF(E20=\"\",0,(HOUR(E20)+MINUTE(E20)/60)))))-(IF(D20=\"\",\"\",(IF(I20=\"\",0,(HOUR(H20)+MINUTE(H20)/60))-IF(E20=\"\",0,(HOUR(F20)+MINUTE(F20)/60)))))))))","v":""},{"$f":"IF(OR(D20=\"§\",D20=\"D\",D20=\"IV\",D20=\"L\",D20=\"N\",D20=\"NpV\",D20=\"NV\",D20=\"OČR\",D20=\"OPP\",D20=\"RD\",D20=\"MD\"),(1/3)*uvazek,\"\")","v":""},{"$f":"IF(D20=\"\",\"\",IF(F20=\"\",(HOUR(I20)+(MINUTE(I20)/60))-(HOUR(E20)+(MINUTE(E20)/60)),IF(E20=\"\",\"\",IF((HOUR(F20)+(MINUTE(F20)/60))-(HOUR(E20)+(MINUTE(E20)/60))>6,(HOUR(F20)+(MINUTE(F20)/60))-(HOUR(E20)+(MINUTE(E20)/60)),\"\"))))","v":""},{"$f":"IF(L20=\"\",0,L20)","v":"00:00:00"},{"$f":"IF(E20=\"\",0,(HOUR(E20)+MINUTE(E20)/60))","v":0},{"$f":"IF(I20=\"\",0,24-(HOUR(I20)+MINUTE(I20)/60))","v":0},{"$f":"IF((T20+U20)=0,\"ANO\",\"NE\")","v":"ANO"},{"$f":"IF(V20=\"ANO\",24,Y19+T20)","v":24},{"$f":"IF(C20=\"Po\",W20,IF(W20=24,IF(W19<>24,W20+U19,X19+W20),IF(W19=24,W20+X19,W20)))","v":{"$error":"#VALUE!"}},{"$f":"IF(C20=\"Po\",IF(C26=\"Ne\",MAX(X21:X27),\"\"),\"\")","v":""},"1 - vyplňte měsíc a rok",null,null,null,null,null,{"$f":"IF(OR(AC20=\"\",AE20=\"So\",AE20=\"Ne\"),\"\",\"P\")","v":""},{"$f":"IF(AF20=\"\",\"\",IF(AF20=\"P\",prichod,\"\"))","v":""},{"$f":"IF(AF20=\"\",\"\",IF(prestavka=\"\",\"\",IF(AF20=\"P\",prestavka,\"\")))","v":""},"-",{"$f":"IF(AH20=\"\",\"\",AH20+1/48)","v":""},{"$f":"IF(AF20=\"\",\"\",IF(AF20=\"P\",odchod,\"\"))","v":""},{"$f":"IF(AF20=\"\",\"\",IF(AF20=\"P\",\"\",VLOOKUP(AF20,vyjímky,2)))","v":""},null,{"$f":"IF(OR(AF20=\"SC\",AF20=\"S\"),(1/3)*uvazek,IF(AF20=\"P\",IF(AR20=\"\",\"\",AR20/24),\"\"))","v":""}]
{"$rows_left_out":42}
{"sheet":"PD_FORMULÁŘ","index":1,"n_rows":53,"n_cols":13,"rows_kept":53,"cut":false,"hidden":true,"merged":[[43,10,43,11],[44,10,44,11],[45,10,45,11],[46,10,46,11],[36,0,36,1],[37,0,37,1],[38,0,38,1],[39,0,39,1],[40,0,40,1],[41,0,41,1],[35,0,35,1],[24,0,24,1],[25,0,25,1],[26,0,26,1],[27,0,27,1],[28,0,28,1],[29,0,29,1],[30,0,30,1],[31,0,31,1],[32,0,32,1],[33,0,33,1],[34,0,34,1],[23,0,23,1],[12,0,12,1],[13,0,13,1],[14,0,14,1],[15,0,15,1],[16,0,16,1],[17,0,17,1],[18,0,18,1],[19,0,19,1],[20,0,20,1],[21,0,21,1],[22,0,22,1],[9,10,10,10],[9,11,9,12],[11,0,11,1],[5,0,5,3],[5,4,5,8],[7,0,7,3],[7,4,7,8],[9,0,10,2],[9,3,10,3],[9,4,10,4],[9,5,10,7],[9,8,10,8],[0,0,0,9],[2,0,3,3],[2,4,2,8],[3,4,3,8],[9,9,10,9]]}
["Evidence pracovní doby"]
[]
["Útvar/NS",null,null,null,{"$f":"IF('Pracovní doba'!$E$11:$I$11=\"\",\"\",'Pracovní doba'!$E$11:$I$11)","v":""}]
[null,null,null,null,{"$f":"IF('Pracovní doba'!$E$12:$I$12=\"\",\"\",'Pracovní doba'!$E$12:$I$12)","v":""}]
[]
["Jméno",null,null,null,{"$f":"IF('Pracovní doba'!$E$14:$I$14=\"\",\"\",'Pracovní doba'!$E$14:$I$14)","v":""},null,null,null,null,"Období",{"$f":"IF('Pracovní doba'!K14=\"\",\"\",'Pracovní doba'!K14)","v":"2022-01-01"}]
[]
["Osobní číslo zaměstnance",null,null,null,{"$f":"IF('Pracovní doba'!$E$16:$I$16=\"\",\"\",'Pracovní doba'!$E$16:$I$16)","v":""},null,null,null,null,"Úvazek",{"$f":"IF('Pracovní doba'!K16=\"\",\"\",'Pracovní doba'!K16)","v":1}]
[]
["Den",null,null,"TYP dne","Příchod","Pracovní přestávka na jídlo a oddech",null,null,"Odchod","Speciální den (vyplňuje se automaticky v závislosti na TYP dne)","Poznámka (V případě potřeby, SC kratší než 1 den apod…)","Odpracováno "]
[null,null,null,null,null,null,null,null,null,null,null,"Celkem       (vč. \"S\" a \"SC\")","z toho        přímá pedag. činnost"]
[1,null,{"$f":"'Pracovní doba'!C20","v":"So"},{"$f":"IF('Pracovní doba'!D20=\"\",\"\",'Pracovní doba'!D20)","v":""},{"$f":"IF('Pracovní doba'!E20=\"\",\"\",'Pracovní doba'!E20)","v":""},{"$f":"IF('Pracovní doba'!F20=\"\",\"\",'Pracovní doba'!F20)","v":""},"-",{"$f":"IF('Pracovní doba'!H20=\"\",\"\",'Pracovní doba'!H20)","v":""},{"$f":"IF('Pracovní doba'!I20=\"\",\"\",'Pracovní doba'!I20)","v":""},{"$f":"IF('Pracovní doba'!J20=\"\",\"\",'Pracovní doba'!J20)","v":""},{"$f":"IF('Pracovní doba'!K20=\"\",\"\",'Pracovní doba'!K20)","v":""},{"$f":"IF('Pracovní doba'!L20=\"\",\"\",'Pracovní doba'!L20)","v":""},{"$f":"IF('Pracovní doba'!M20=\"\",\"\",'Pracovní doba'!M20)","v":""}]
[{"$f":"'Pracovní doba'!A21:B21","v":2},null,{"$f":"'Pracovní doba'!C21","v":"Ne"},{"$f":"IF('Pracovní doba'!D21=\"\",\"\",'Pracovní doba'!D21)","v":""},{"$f":"IF('Pracovní doba'!E21=\"\",\"\",'Pracovní doba'!E21)","v":""},{"$f":"IF('Pracovní doba'!F21=\"\",\"\",'Pracovní doba'!F21)","v":""},"-",{"$f":"IF('Pracovní doba'!H21=\"\",\"\",'Pracovní doba'!H21)","v":""},{"$f":"IF('Pracovní doba'!I21=\"\",\"\",'Pracovní doba'!I21)","v":""},{"$f":"IF('Pracovní doba'!J21=\"\",\"\",'Pracovní doba'!J21)","v":""},{"$f":"IF('Pracovní doba'!K21=\"\",\"\",'Pracovní doba'!K21)","v":""},{"$f":"IF('Pracovní doba'!L21=\"\",\"\",'Pracovní doba'!L21)","v":""},{"$f":"IF('Pracovní doba'!M21=\"\",\"\",'Pracovní doba'!M21)","v":""}]
[{"$f":"'Pracovní doba'!A22:B22","v":3},null,{"$f":"'Pracovní doba'!C22","v":"Po"},{"$f":"IF('Pracovní doba'!D22=\"\",\"\",'Pracovní doba'!D22)","v":"P"},{"$f":"IF('Pracovní doba'!E22=\"\",\"\",'Pracovní doba'!E22)","v":"07:00:00"},{"$f":"IF('Pracovní doba'!F22=\"\",\"\",'Pracovní doba'!F22)","v":"11:00:00"},"-",{"$f":"IF('Pracovní doba'!H22=\"\",\"\",'Pracovní doba'!H22)","v":"11:30:00"},{"$f":"IF('Pracovní doba'!I22=\"\",\"\",'Pracovní doba'!I22)","v":"15:30:00"},{"$f":"IF('Pracovní doba'!J22=\"\",\"\",'Pracovní doba'!J22)","v":""},{"$f":"IF('Pracovní doba'!K22=\"\",\"\",'Pracovní doba'!K22)","v":""},{"$f":"IF('Pracovní doba'!L22=\"\",\"\",'Pracovní doba'!L22)","v":"08:00:00"},{"$f":"IF('Pracovní doba'!M22=\"\",\"\",'Pracovní doba'!M22)","v":""}]
[{"$f":"'Pracovní doba'!A23:B23","v":4},null,{"$f":"'Pracovní doba'!C23","v":"Út"},{"$f":"IF('Pracovní doba'!D23=\"\",\"\",'Pracovní doba'!D23)","v":"P"},{"$f":"IF('Pracovní doba'!E23=\"\",\"\",'Pracovní doba'!E23)","v":"07:00:00"},{"$f":"IF('Pracovní doba'!F23=\"\",\"\",'Pracovní doba'!F23)","v":"11:00:00"},"-",{"$f":"IF('Pracovní doba'!H23=\"\",\"\",'Pracovní doba'!H23)","v":"11:30:00"},{"$f":"IF('Pracovní doba'!I23=\"\",\"\",'Pracovní doba'!I23)","v":"15:30:00"},{"$f":"IF('Pracovní doba'!J23=\"\",\"\",'Pracovní doba'!J23)","v":""},{"$f":"IF('Pracovní doba'!K23=\"\",\"\",'Pracovní doba'!K23)","v":""},{"$f":"IF('Pracovní doba'!L23=\"\",\"\",'Pracovní doba'!L23)","v":"08:00:00"},{"$f":"IF('Pracovní doba'!M23=\"\",\"\",'Pracovní doba'!M23)","v":""}]
[{"$f":"'Pracovní doba'!A24:B24","v":5},null,{"$f":"'Pracovní doba'!C24","v":"St"},{"$f":"IF('Pracovní doba'!D24=\"\",\"\",'Pracovní doba'!D24)","v":"P"},{"$f":"IF('Pracovní doba'!E24=\"\",\"\",'Pracovní doba'!E24)","v":"07:00:00"},{"$f":"IF('Pracovní doba'!F24=\"\",\"\",'Pracovní doba'!F24)","v":"11:00:00"},"-",{"$f":"IF('Pracovní doba'!H24=\"\",\"\",'Pracovní doba'!H24)","v":"11:30:00"},{"$f":"IF('Pracovní doba'!I24=\"\",\"\",'Pracovní doba'!I24)","v":"15:30:00"},{"$f":"IF('Pracovní doba'!J24=\"\",\"\",'Pracovní doba'!J24)","v":""},{"$f":"IF('Pracovní doba'!K24=\"\",\"\",'Pracovní doba'!K24)","v":""},{"$f":"IF('Pracovní doba'!L24=\"\",\"\",'Pracovní doba'!L24)","v":"08:00:00"},{"$f":"IF('Pracovní doba'!M24=\"\",\"\",'Pracovní doba'!M24)","v":""}]
[{"$f":"'Pracovní doba'!A25:B25","v":6},null,{"$f":"'Pracovní doba'!C25","v":"Čt"},{"$f":"IF('Pracovní doba'!D25=\"\",\"\",'Pracovní doba'!D25)","v":"P"},{"$f":"IF('Pracovní doba'!E25=\"\",\"\",'Pracovní doba'!E25)","v":"07:00:00"},{"$f":"IF('Pracovní doba'!F25=\"\",\"\",'Pracovní doba'!F25)","v":"11:00:00"},"-",{"$f":"IF('Pracovní doba'!H25=\"\",\"\",'Pracovní doba'!H25)","v":"11:30:00"},{"$f":"IF('Pracovní doba'!I25=\"\",\"\",'Pracovní doba'!I25)","v":"15:30:00"},{"$f":"IF('Pracovní doba'!J25=\"\",\"\",'Pracovní doba'!J25)","v":""},{"$f":"IF('Pracovní doba'!K25=\"\",\"\",'Pracovní doba'!K25)","v":""},{"$f":"IF('Pracovní doba'!L25=\"\",\"\",'Pracovní doba'!L25)","v":"08:00:00"},{"$f":"IF('Pracovní doba'!M25=\"\",\"\",'Pracovní doba'!M25)","v":""}]
[{"$f":"'Pracovní doba'!A26:B26","v":7},null,{"$f":"'Pracovní doba'!C26","v":"Pá"},{"$f":"IF('Pracovní doba'!D26=\"\",\"\",'Pracovní doba'!D26)","v":"P"},{"$f":"IF('Pracovní doba'!E26=\"\",\"\",'Pracovní doba'!E26)","v":"07:00:00"},{"$f":"IF('Pracovní doba'!F26=\"\",\"\",'Pracovní doba'!F26)","v":"11:00:00"},"-",{"$f":"IF('Pracovní doba'!H26=\"\",\"\",'Pracovní doba'!H26)","v":"11:30:00"},{"$f":"IF('Pracovní doba'!I26=\"\",\"\",'Pracovní doba'!I26)","v":"15:30:00"},{"$f":"IF('Pracovní doba'!J26=\"\",\"\",'Pracovní doba'!J26)","v":""},{"$f":"IF('Pracovní doba'!K26=\"\",\"\",'Pracovní doba'!K26)","v":""},{"$f":"IF('Pracovní doba'!L26=\"\",\"\",'Pracovní doba'!L26)","v":"08:00:00"},{"$f":"IF('Pracovní doba'!M26=\"\",\"\",'Pracovní doba'!M26)","v":""}]
[{"$f":"'Pracovní doba'!A27:B27","v":8},null,{"$f":"'Pracovní doba'!C27","v":"So"},{"$f":"IF('Pracovní doba'!D27=\"\",\"\",'Pracovní doba'!D27)","v":""},{"$f":"IF('Pracovní doba'!E27=\"\",\"\",'Pracovní doba'!E27)","v":""},{"$f":"IF('Pracovní doba'!F27=\"\",\"\",'Pracovní doba'!F27)","v":""},"-",{"$f":"IF('Pracovní doba'!H27=\"\",\"\",'Pracovní doba'!H27)","v":""},{"$f":"IF('Pracovní doba'!I27=\"\",\"\",'Pracovní doba'!I27)","v":""},{"$f":"IF('Pracovní doba'!J27=\"\",\"\",'Pracovní doba'!J27)","v":""},{"$f":"IF('Pracovní doba'!K27=\"\",\"\",'Pracovní doba'!K27)","v":""},{"$f":"IF('Pracovní doba'!L27=\"\",\"\",'Pracovní doba'!L27)","v":""},{"$f":"IF('Pracovní doba'!M27=\"\",\"\",'Pracovní doba'!M27)","v":""}]
[{"$f":"'Pracovní doba'!A28:B28","v":9},null,{"$f":"'Pracovní doba'!C28","v":"Ne"},{"$f":"IF('Pracovní doba'!D28=\"\",\"\",'Pracovní doba'!D28)","v":""},{"$f":"IF('Pracovní doba'!E28=\"\",\"\",'Pracovní doba'!E28)","v":""},{"$f":"IF('Pracovní doba'!F28=\"\",\"\",'Pracovní doba'!F28)","v":""},"-",{"$f":"IF('Pracovní doba'!H28=\"\",\"\",'Pracovní doba'!H28)","v":""},{"$f":"IF('Pracovní doba'!I28=\"\",\"\",'Pracovní doba'!I28)","v":""},{"$f":"IF('Pracovní doba'!J28=\"\",\"\",'Pracovní doba'!J28)","v":""},{"$f":"IF('Pracovní doba'!K28=\"\",\"\",'Pracovní doba'!K28)","v":""},{"$f":"IF('Pracovní doba'!L28=\"\",\"\",'Pracovní doba'!L28)","v":""},{"$f":"IF('Pracovní doba'!M28=\"\",\"\",'Pracovní doba'!M28)","v":""}]
{"$rows_left_out":34}
{"sheet":"typ dne","index":2,"n_rows":61,"n_cols":26,"rows_kept":61,"cut":false,"hidden":true,"merged":[]}
[null,null,"Po","Út","St","Čt","Pá","So","Ne",null,null,null,null,null,null,null,null,null,null,null,null,null,null,"NS","Název pracoviště","NS"]
["§","placený paragraf ","§","§","§","§","§","P","P",null,1,2,3,4,5,6,7,null,1,2019,{"$f":"DATE(T2,S2,1)","v":"2019-01-01"},184,null,"090800","Děkanát","090800"]
["D","dovolená","D","D","D","D","D",null,null,null,"Po","Út","St","Čt","Pá","So","Ne",null,2,2019,"2019-02-01",1690,null,"090812","Ekonomické pracoviště","090812"]
["IV","indispoziční volno","IV","IV","IV","IV","IV",null,null,null,null,null,null,null,null,null,null,null,3,2019,"2019-03-01",168,null,"090053","Experimentální rybochovné pracoviště a pokusnictví","090053"]
["L","lékař","L","L","L","L","L",null,null,null,null,null,null,null,null,null,null,null,4,2019,"2019-04-01",176,null,"090052","Genetické rybářské centrum","090052"]
["MD","mateřská dovolená","MD","MD","MD","MD","MD",null,null,null,null,null,null,null,null,null,null,null,5,2019,"2019-05-01",184,null,"092410","Kancelář CENAKVA","092410"]
["N","nemoc","N","N","N","N","N",null,null,null,null,null,null,null,null,null,null,null,6,2019,"2019-06-01",160,null,"090811","Kancelář děkana","090811"]
["NpV","neplacené volno","NpV","NpV","NpV","NpV","NpV",null,null,null,null,null,null,null,null,null,null,null,7,2019,"2019-07-01",184,null,"090119","Kancelář ÚAOV","090119"]
["NV","náhradní volno","NV","NV","NV","NV","NV",null,null,null,null,null,null,null,null,null,null,null,8,2019,"2019-08-01",176,null,"090219","Kancelář ÚKS","090219"]
["OČR","ošetřování člena rodiny","OČR","OČR","OČR","OČR","OČR",null,null,null,null,null,null,null,null,null,null,null,9,2019,"2019-09-01",168,null,"090019","Kancelář VÚRH","090019"]
["OPP","otcovská poporodní péče","OPP","OPP","OPP","OPP","OPP",null,null,null,null,null,null,null,null,null,null,null,10,2019,"2019-10-01",184,null,"090031","Laboratoř environmentální chemie a biochemie","090031"]
["P","odpracovaná doba","P","P","P","P","P",null,null,null,null,null,null,null,null,null,null,null,11,2019,"2019-11-01",168,null,"090211","Laboratoř experimentálních komplexních systémů","090211"]
["RD","rodičovská dovolená","RD","RD","RD","RD","RD",null,null,null,null,null,null,null,null,null,null,null,12,2019,"2019-12-01",176,null,"090021","Laboratoř fyziologie reprodukce","090021"]
["S","svátek","S","S","S","S","S",null,null,null,null,null,null,null,null,null,null,null,1,2020,"2020-01-01",184,null,"090012","Laboratoř intenzivní akvakultury","090012"]
["SC","služební cesta","SC","SC","SC","SC","SC",null,null,null,null,null,null,null,null,null,null,null,2,2020,"2020-02-01",160,null,"090022","Laboratoř molekulární buněčné a kvantitativní genetiky","090022"]
[null,null,null,null,null,null,null,null,null,null,null,null,null,null,null,null,null,null,3,2020,"2020-03-01",176,null,"090171","Laboratoř řízené reprodukce a intenzivního chovu ryb","090171"]
[null,null,null,null,null,null,null,null,null,null,null,null,null,null,null,null,null,null,4,2020,"2020-04-01",176,null,"090011","Laboratoř sladkovodních ekosystémů","090011"]
[null,null,null,null,null,null,null,null,null,null,null,null,null,null,null,null,null,null,5,2020,"2020-05-01",168,null,"090032","Laboratoř vodní toxikologie a ichtyopatologie","090032"]
[null,null,null,null,null,null,null,null,null,null,null,null,null,null,null,null,null,null,6,2020,"2020-06-01",176,null,"090191","Laboratoř výživy","090191"]
[null,null,null,null,null,null,null,null,null,null,null,null,null,null,null,null,null,null,7,2020,"2020-07-01",184,null,"090023","Laboratoř zárodečných buněk","090023"]
{"$rows_left_out":42}
{"sheet":"List1","index":3,"n_rows":24,"n_cols":2,"rows_kept":24,"cut":false,"hidden":true,"merged":[]}
["01:00:00",1]
["02:00:00",2]
["03:00:00",3]
["04:00:00",4]
["05:00:00",5]
["06:00:00",6]
["07:00:00",7]
["08:00:00",8]
["09:00:00",9]
["10:00:00",10]
["11:00:00",11]
["12:00:00",12]
["13:00:00",13]
["14:00:00",14]
["15:00:00",15]
["16:00:00",16]
["17:00:00",17]
["18:00:00",18]
["19:00:00",19]
["20:00:00",20]
{"$rows_left_out":4}